{"text_format":"1","workbook":"xlsx","n_sheets":7,"sheets":["1. Explications","2. Prix actuels","3. Coûts des machines","4. Données de calcul","5. Granph. frais totaux","6. Graph. frais fixes et vari.","7. Graph. coûts horaires"],"not_rendered":{"charts":5,"images":3,"macros":0,"external_links":0,"defined_names":4,"comments":1,"pivot_tables":0},"unopened":[],"bounds":{"document_bytes":16777216,"sheet_cells":100000,"rows_first":2000,"rows_last":500,"rows_between":2000,"halvings":0,"cell_chars":16384,"cell_head_chars":4096},"cells_cut":0,"cells_raw":0,"read":"whole","date_system":"1900"}

{"sheet":"1. Explications","index":0,"n_rows":0,"n_cols":0,"rows_kept":0,"cut":false,"hidden":false,"merged":[]}

{"sheet":"2. Prix actuels","index":1,"n_rows":34,"n_cols":3,"rows_kept":34,"cut":false,"hidden":false,"merged":[]}
[]
[null,"Propriétaire :","Commune de Tully"]
["Taux et prix actuels",null,2020]
[]
["Salaires:"]
["Machiniste",null,55]
[]
["Carburant, par litre:"]
["Diesel",null,1.65]
["Essence (sans plomb)",null,1.6]
["Essence 2 temps","Non",1.74]
["Essence sans benzène",{"$f":"IF(B11=\"Non\",\"Oui\",\"Non\")","v":"Oui"},3.5]
[]
["Lubrifiant, par litre:"]
["Huile de moteur",null,6.5]
{"$rows_left_out":20}
{"sheet":"3. Coûts des machines","index":2,"n_rows":115,"n_cols":8,"rows_kept":115,"cut":false,"hidden":false,"merged":[]}
[null,"Coût des machines",null,"Propriétaire :",{"$f":"'2. Prix actuels'!C2","v":"Commune de Tully"}]
[null,null,null,"Objet 1","Objet 2","Objet 3","Objet 4"]
[null,"Machine",null,71,71,71,71,"Totale"]
[null,"Numéro",null,{"$f":"INDEX('4. Données de calcul'!$C$4:$C$75,MATCH(D$3,'4. Données de calcul'!$B$4:$B$75,0))","v":0},{"$f":"INDEX('4. Données de calcul'!$C$4:$C$75,MATCH(E$3,'4. Données de calcul'!$B$4:$B$75,0))","v":0},{"$f":"INDEX('4. Données de calcul'!$C$4:$C$75,MATCH(F$3,'4. Données de calcul'!$B$4:$B$75,0))","v":0},{"$f":"INDEX('4. Données de calcul'!$C$4:$C$75,MATCH(G$3,'4. Données de calcul'!$B$4:$B$75,0))","v":0}]
[null,"Puissance en kW",null,{"$f":"INDEX('4. Données de calcul'!$E$4:$E$75,MATCH(D$3,'4. Données de calcul'!$B$4:$B$75,0))","v":0},{"$f":"INDEX('4. Données de calcul'!$E$4:$E$75,MATCH(E$3,'4. Données de calcul'!$B$4:$B$75,0))","v":0},{"$f":"INDEX('4. Données de calcul'!$E$4:$E$75,MATCH(F$3,'4. Données de calcul'!$B$4:$B$75,0))","v":0},{"$f":"INDEX('4. Données de calcul'!$E$4:$E$75,MATCH(G$3,'4. Données de calcul'!$B$4:$B$75,0))","v":0}]
[null,"Utilisation annuelle en heure",null,250,350,350,250]
[null,"Prix d'achat","P",{"$f":"INDEX('4. Données de calcul'!$F$4:$F$75,MATCH(D$3,'4. Données de calcul'!$B$4:$B$75,0))","v":0},{"$f":"INDEX('4. Données de calcul'!$F$4:$F$75,MATCH(E$3,'4. Données de calcul'!$B$4:$B$75,0))","v":0},{"$f":"INDEX('4. Données de calcul'!$F$4:$F$75,MATCH(F$3,'4. Données de calcul'!$B$4:$B$75,0))","v":0},{"$f":"INDEX('4. Données de calcul'!$F$4:$F$75,MATCH(G$3,'4. Données de calcul'!$B$4:$B$75,0))","v":0},{"$f":"SUM(D7:G7)","v":0}]
[null,"Valeur de liquidation","L",{"$f":"INDEX('4. Données de calcul'!G$4:G$75,MATCH(D$3,'4. Données de calcul'!$B$4:$B$75,0))","v":0},{"$f":"INDEX('4. Données de calcul'!G$4:G$75,MATCH(E$3,'4. Données de calcul'!$B$4:$B$75,0))","v":0},{"$f":"INDEX('4. Données de calcul'!G$4:G$75,MATCH(F$3,'4. Données de calcul'!$B$4:$B$75,0))","v":0},{"$f":"INDEX('4. Données de calcul'!G$4:G$75,MATCH(G$3,'4. Données de calcul'!$B$4:$B$75,0))","v":0},{"$f":"SUM(D8:G8)","v":0}]
[null,"Taux d'intérêts","T",{"$f":"INDEX('4. Données de calcul'!$H$4:$H$75,MATCH(D$3,'4. Données de calcul'!$B$4:$B$75,0))","v":0},{"$f":"INDEX('4. Données de calcul'!$H$4:$H$75,MATCH(E$3,'4. Données de calcul'!$B$4:$B$75,0))","v":0},{"$f":"INDEX('4. Données de calcul'!$H$4:$H$75,MATCH(F$3,'4. Données de calcul'!$B$4:$B$75,0))","v":0},{"$f":"INDEX('4. Données de calcul'!$H$4:$H$75,MATCH(G$3,'4. Données de calcul'!$B$4:$B$75,0))","v":0}]
[null,"Durée d'utilisation en heures","H",{"$f":"INDEX('4. Données de calcul'!$I$4:$I$75,MATCH(D$3,'4. Données de calcul'!$B$4:$B$75,0))","v":0},{"$f":"INDEX('4. Données de calcul'!$I$4:$I$75,MATCH(E$3,'4. Données de calcul'!$B$4:$B$75,0))","v":0},{"$f":"INDEX('4. Données de calcul'!$I$4:$I$75,MATCH(F$3,'4. Données de calcul'!$B$4:$B$75,0))","v":0},{"$f":"INDEX('4. Données de calcul'!$I$4:$I$75,MATCH(G$3,'4. Données de calcul'!$B$4:$B$75,0))","v":0}]
[null,"Durée d'utilisation en années","D",{"$f":"INDEX('4. Données de calcul'!$J$4:$J$75,MATCH(D$3,'4. Données de calcul'!$B$4:$B$75,0))","v":0},{"$f":"INDEX('4. Données de calcul'!$J$4:$J$75,MATCH(E$3,'4. Données de calcul'!$B$4:$B$75,0))","v":0},{"$f":"INDEX('4. Données de calcul'!$J$4:$J$75,MATCH(F$3,'4. Données de calcul'!$B$4:$B$75,0))","v":0},{"$f":"INDEX('4. Données de calcul'!$J$4:$J$75,MATCH(G$3,'4. Données de calcul'!$B$4:$B$75,0))","v":0}]
[null,"Durée d'utilisation en années (effective)","D",{"$f":"IF(D10/D6>D11,D11,D10/D6)","v":0},{"$f":"IF(E10/E6>E11,E11,E10/E6)","v":0},{"$f":"IF(F10/F6>F11,F11,F10/F6)","v":0},{"$f":"IF(G10/G6>G11,G11,G10/G6)","v":0}]
[null,"Facteur de réparation","R",{"$f":"INDEX('4. Données de calcul'!$K$4:$K$75,MATCH(D$3,'4. Données de calcul'!$B$4:$B$75,0))","v":0},{"$f":"INDEX('4. Données de calcul'!$K$4:$K$75,MATCH(E$3,'4. Données de calcul'!$B$4:$B$75,0))","v":0},{"$f":"INDEX('4. Données de calcul'!$K$4:$K$75,MATCH(F$3,'4. Données de calcul'!$B$4:$B$75,0))","v":0},{"$f":"INDEX('4. Données de calcul'!$K$4:$K$75,MATCH(G$3,'4. Données de calcul'!$B$4:$B$75,0))","v":0}]
[null,"Prix du carburant","C",{"$f":"INDEX('4. Données de calcul'!$M$4:$M$75,MATCH(D$3,'4. Données de calcul'!$B$4:$B$75,0))","v":0},{"$f":"INDEX('4. Données de calcul'!$M$4:$M$75,MATCH(E$3,'4. Données de calcul'!$B$4:$B$75,0))","v":0},{"$f":"INDEX('4. Données de calcul'!$M$4:$M$75,MATCH(F$3,'4. Données de calcul'!$B$4:$B$75,0))","v":0},{"$f":"INDEX('4. Données de calcul'!$M$4:$M$75,MATCH(G$3,'4. Données de calcul'!$B$4:$B$75,0))","v":0}]
[null,"Prix du lubrifiant","L",{"$f":"INDEX('4. Données de calcul'!$O$4:$O$75,MATCH(D$3,'4. Données de calcul'!$B$4:$B$75,0))","v":0},{"$f":"INDEX('4. Données de calcul'!$O$4:$O$75,MATCH(E$3,'4. Données de calcul'!$B$4:$B$75,0))","v":0},{"$f":"INDEX('4. Données de calcul'!$O$4:$O$75,MATCH(F$3,'4. Données de calcul'!$B$4:$B$75,0))","v":0},{"$f":"INDEX('4. Données de calcul'!$O$4:$O$75,MATCH(G$3,'4. Données de calcul'!$B$4:$B$75,0))","v":0}]
{"$rows_left_out":101}
{"sheet":"4. Données de calcul","index":3,"n_rows":74,"n_cols":29,"rows_kept":74,"cut":false,"hidden":false,"merged":[]}
[null,null,null,null,null,null,null,null,null,null,null,"Prix carburant et lubrifiant",null,null,null,null,null,null,null,"Taxes et assurances",null,null,null,null,null,null,null,"Consommation"]
["Données"]
["Catégorie","Nr","No.","Description de la machine","kW","Prix d'achat","Valeur de\nliquidaion","Taux\nd'intérêts","Durée d'utililisation\nmaximum en heures","Durée d'utilisation\nmaximum en années","Facteur\nréparation","G.","Carburant","G.","Lubrifiant","O/N","Salaires","O/N","Charges\nd'immeubles","O/N","Plaque/impôts","O/N","RC","O/N","Casco","O/N","Assurance\nincendie","Carburant l/h","Lubrifiant l/h"]
["Petit outillage manuel",1,1.1100000000000001,"Tronçonneuse légère"," ",1100,{"$f":"IF(F4>0,F4*'2. Prix actuels'!$C$32/100,0)","v":55},{"$f":"IF(F4>0,'2. Prix actuels'!$C$30,0)","v":5},1200,3,1.2,{"$f":"IF('2. Prix actuels'!$B$11=\"Oui\",3,4)","v":4},{"$f":"_xlfn.IFS(L4=1,'2. Prix actuels'!$C$9,L4=2,'2. Prix actuels'!$C$10,L4=3,'2. Prix actuels'!$C$11,L4=4,'2. Prix actuels'!$C$12,L4<1,0)","v":3.5},3,{"$f":"_xlfn.IFS(N4=1,'2. Prix actuels'!$C$15,N4=2,'2. Prix actuels'!$C$16,N4=3,'2. Prix actuels'!$C$17,N4<1,0)","v":5.2},"O",{"$f":"IF(P4=\"o\",'2. Prix actuels'!$C$6,0)","v":55},"O",{"$f":"IF(R4=\"o\",IF('2. Prix actuels'!$C$21*F4/100<=6000,'2. Prix actuels'!$C$21*'4. Données de calcul'!F4/100,6000),0)","v":22},"N",{"$f":"IF(T4=\"o\",'2. Prix actuels'!$C$24,0)","v":0},"N",{"$f":"IF(V4=\"o\",'2. Prix actuels'!$C$25,0)","v":0},"N",{"$f":"IF(X4=\"o\",F4*'2. Prix actuels'!$C$27/100,0)","v":0},"O",{"$f":"IF(Z4=\"o\",F4*'2. Prix actuels'!$C$26/100,0)","v":2.2000000000000002},1,0.5]
["Petit outillage manuel",2,1.1200000000000001,"Tronçonneuse moyenne"," ",1650,{"$f":"IF(F5>0,F5*'2. Prix actuels'!$C$32/100,0)","v":82.5},{"$f":"IF(F5>0,'2. Prix actuels'!$C$30,0)","v":5},1200,3,1,{"$f":"IF('2. Prix actuels'!$B$11=\"Oui\",3,4)","v":4},{"$f":"_xlfn.IFS(L5=1,'2. Prix actuels'!$C$9,L5=2,'2. Prix actuels'!$C$10,L5=3,'2. Prix actuels'!$C$11,L5=4,'2. Prix actuels'!$C$12,L5<1,0)","v":3.5},3,{"$f":"_xlfn.IFS(N5=1,'2. Prix actuels'!$C$15,N5=2,'2. Prix actuels'!$C$16,N5=3,'2. Prix actuels'!$C$17,N5<1,0)","v":5.2},"O",{"$f":"IF(P5=\"o\",'2. Prix actuels'!$C$6,0)","v":55},"O",{"$f":"IF(R5=\"o\",IF('2. Prix actuels'!$C$21*F5/100<=6000,'2. Prix actuels'!$C$21*'4. Données de calcul'!F5/100,6000),0)","v":33},"N",{"$f":"IF(T5=\"o\",'2. Prix actuels'!$C$24,0)","v":0},"N",{"$f":"IF(V5=\"o\",'2. Prix actuels'!$C$25,0)","v":0},"N",{"$f":"IF(X5=\"o\",F5*'2. Prix actuels'!$C$27/100,0)","v":0},"O",{"$f":"IF(Z5=\"o\",F5*'2. Prix actuels'!$C$26/100,0)","v":3.3},1.5,0.75]
["Petit outillage manuel",3,1.1299999999999999,"Tronçonneuse lourde",null,2100,{"$f":"IF(F6>0,F6*'2. Prix actuels'!$C$32/100,0)","v":105},{"$f":"IF(F6>0,'2. Prix actuels'!$C$30,0)","v":5},1200,3,0.9,{"$f":"IF('2. Prix actuels'!$B$11=\"Oui\",3,4)","v":4},{"$f":"_xlfn.IFS(L6=1,'2. Prix actuels'!$C$9,L6=2,'2. Prix actuels'!$C$10,L6=3,'2. Prix actuels'!$C$11,L6=4,'2. Prix actuels'!$C$12,L6<1,0)","v":3.5},3,{"$f":"_xlfn.IFS(N6=1,'2. Prix actuels'!$C$15,N6=2,'2. Prix actuels'!$C$16,N6=3,'2. Prix actuels'!$C$17,N6<1,0)","v":5.2},"O",{"$f":"IF(P6=\"o\",'2. Prix actuels'!$C$6,0)","v":55},"O",{"$f":"IF(R6=\"o\",IF('2. Prix actuels'!$C$21*F6/100<=6000,'2. Prix actuels'!$C$21*'4. Données de calcul'!F6/100,6000),0)","v":42},"N",{"$f":"IF(T6=\"o\",'2. Prix actuels'!$C$24,0)","v":0},"N",{"$f":"IF(V6=\"o\",'2. Prix actuels'!$C$25,0)","v":0},"N",{"$f":"IF(X6=\"o\",F6*'2. Prix actuels'!$C$27/100,0)","v":0},"O",{"$f":"IF(Z6=\"o\",F6*'2. Prix actuels'!$C$26/100,0)","v":4.2},2,1]
["Petit outillage manuel",4,1.21,"Débroussailleuse légère",null,1100,{"$f":"IF(F7>0,F7*'2. Prix actuels'!$C$32/100,0)","v":55},{"$f":"IF(F7>0,'2. Prix actuels'!$C$30,0)","v":5},1200,4,0.6,{"$f":"IF('2. Prix actuels'!$B$11=\"Oui\",3,4)","v":4},{"$f":"_xlfn.IFS(L7=1,'2. Prix actuels'!$C$9,L7=2,'2. Prix actuels'!$C$10,L7=3,'2. Prix actuels'!$C$11,L7=4,'2. Prix actuels'!$C$12,L7<1,0)","v":3.5},0,{"$f":"_xlfn.IFS(N7=1,'2. Prix actuels'!$C$15,N7=2,'2. Prix actuels'!$C$16,N7=3,'2. Prix actuels'!$C$17,N7<1,0)","v":0},"O",{"$f":"IF(P7=\"o\",'2. Prix actuels'!$C$6,0)","v":55},"O",{"$f":"IF(R7=\"o\",IF('2. Prix actuels'!$C$21*F7/100<=6000,'2. Prix actuels'!$C$21*'4. Données de calcul'!F7/100,6000),0)","v":22},"N",{"$f":"IF(T7=\"o\",'2. Prix actuels'!$C$24,0)","v":0},"N",{"$f":"IF(V7=\"o\",'2. Prix actuels'!$C$25,0)","v":0},"N",{"$f":"IF(X7=\"o\",F7*'2. Prix actuels'!$C$27/100,0)","v":0},"O",{"$f":"IF(Z7=\"o\",F7*'2. Prix actuels'!$C$26/100,0)","v":2.2000000000000002},1,0]
["Petit outillage manuel",5,1.22,"Débroussailleuse moyenne",null,1450,{"$f":"IF(F8>0,F8*'2. Prix actuels'!$C$32/100,0)","v":72.5},{"$f":"IF(F8>0,'2. Prix actuels'!$C$30,0)","v":5},1200,4,0.6,{"$f":"IF('2. Prix actuels'!$B$11=\"Oui\",3,4)","v":4},{"$f":"_xlfn.IFS(L8=1,'2. Prix actuels'!$C$9,L8=2,'2. Prix actuels'!$C$10,L8=3,'2. Prix actuels'!$C$11,L8=4,'2. Prix actuels'!$C$12,L8<1,0)","v":3.5},0,{"$f":"_xlfn.IFS(N8=1,'2. Prix actuels'!$C$15,N8=2,'2. Prix actuels'!$C$16,N8=3,'2. Prix actuels'!$C$17,N8<1,0)","v":0},"O",{"$f":"IF(P8=\"o\",'2. Prix actuels'!$C$6,0)","v":55},"O",{"$f":"IF(R8=\"o\",IF('2. Prix actuels'!$C$21*F8/100<=6000,'2. Prix actuels'!$C$21*'4. Données de calcul'!F8/100,6000),0)","v":29},"N",{"$f":"IF(T8=\"o\",'2. Prix actuels'!$C$24,0)","v":0},"N",{"$f":"IF(V8=\"o\",'2. Prix actuels'!$C$25,0)","v":0},"N",{"$f":"IF(X8=\"o\",F8*'2. Prix actuels'!$C$27/100,0)","v":0},"O",{"$f":"IF(Z8=\"o\",F8*'2. Prix actuels'!$C$26/100,0)","v":2.9},1.25,0]
["Petit outillage manuel",6,1.23,"Débroussailleuse lourde",null,2050,{"$f":"IF(F9>0,F9*'2. Prix actuels'!$C$32/100,0)","v":102.5},{"$f":"IF(F9>0,'2. Prix actuels'!$C$30,0)","v":5},1200,4,0.6,{"$f":"IF('2. Prix actuels'!$B$11=\"Oui\",3,4)","v":4},{"$f":"_xlfn.IFS(L9=1,'2. Prix actuels'!$C$9,L9=2,'2. Prix actuels'!$C$10,L9=3,'2. Prix actuels'!$C$11,L9=4,'2. Prix actuels'!$C$12,L9<1,0)","v":3.5},0,{"$f":"_xlfn.IFS(N9=1,'2. Prix actuels'!$C$15,N9=2,'2. Prix actuels'!$C$16,N9=3,'2. Prix actuels'!$C$17,N9<1,0)","v":0},"O",{"$f":"IF(P9=\"o\",'2. Prix actuels'!$C$6,0)","v":55},"O",{"$f":"IF(R9=\"o\",IF('2. Prix actuels'!$C$21*F9/100<=6000,'2. Prix actuels'!$C$21*'4. Données de calcul'!F9/100,6000),0)","v":41},"N",{"$f":"IF(T9=\"o\",'2. Prix actuels'!$C$24,0)","v":0},"N",{"$f":"IF(V9=\"o\",'2. Prix actuels'!$C$25,0)","v":0},"N",{"$f":"IF(X9=\"o\",F9*'2. Prix actuels'!$C$27/100,0)","v":0},"O",{"$f":"IF(Z9=\"o\",F9*'2. Prix actuels'!$C$26/100,0)","v":4.0999999999999996},1.5,0]
["Petit outillage manuel",7,1.31,"Scie à moteur avec treuil moyenne",null,3800,{"$f":"IF(F10>0,F10*'2. Prix actuels'!$C$32/100,0)","v":190},{"$f":"IF(F10>0,'2. Prix actuels'!$C$30,0)","v":5},1200,5,1,{"$f":"IF('2. Prix actuels'!$B$11=\"Oui\",3,4)","v":4},{"$f":"_xlfn.IFS(L10=1,'2. Prix actuels'!$C$9,L10=2,'2. Prix actuels'!$C$10,L10=3,'2. Prix actuels'!$C$11,L10=4,'2. Prix actuels'!$C$12,L10<1,0)","v":3.5},0,{"$f":"_xlfn.IFS(N10=1,'2. Prix actuels'!$C$15,N10=2,'2. Prix actuels'!$C$16,N10=3,'2. Prix actuels'!$C$17,N10<1,0)","v":0},"O",{"$f":"IF(P10=\"o\",'2. Prix actuels'!$C$6,0)","v":55},"O",{"$f":"IF(R10=\"o\",IF('2. Prix actuels'!$C$21*F10/100<=6000,'2. Prix actuels'!$C$21*'4. Données de calcul'!F10/100,6000),0)","v":76},"N",{"$f":"IF(T10=\"o\",'2. Prix actuels'!$C$24,0)","v":0},"N",{"$f":"IF(V10=\"o\",'2. Prix actuels'!$C$25,0)","v":0},"N",{"$f":"IF(X10=\"o\",F10*'2. Prix actuels'!$C$27/100,0)","v":0},"O",{"$f":"IF(Z10=\"o\",F10*'2. Prix actuels'!$C$26/100,0)","v":7.6},1.5,0]
["Petit outillage manuel",8,1.41,"Tarière légère",null,900,{"$f":"IF(F11>0,F11*'2. Prix actuels'!$C$32/100,0)","v":45},{"$f":"IF(F11>0,'2. Prix actuels'!$C$30,0)","v":5},1200,6,0.6,{"$f":"IF('2. Prix actuels'!$B$11=\"Oui\",3,4)","v":4},{"$f":"_xlfn.IFS(L11=1,'2. Prix actuels'!$C$9,L11=2,'2. Prix actuels'!$C$10,L11=3,'2. Prix actuels'!$C$11,L11=4,'2. Prix actuels'!$C$12,L11<1,0)","v":3.5},0,{"$f":"_xlfn.IFS(N11=1,'2. Prix actuels'!$C$15,N11=2,'2. Prix actuels'!$C$16,N11=3,'2. Prix actuels'!$C$17,N11<1,0)","v":0},"O",{"$f":"IF(P11=\"o\",'2. Prix actuels'!$C$6,0)","v":55},"O",{"$f":"IF(R11=\"o\",IF('2. Prix actuels'!$C$21*F11/100<=6000,'2. Prix actuels'!$C$21*'4. Données de calcul'!F11/100,6000),0)","v":18},"N",{"$f":"IF(T11=\"o\",'2. Prix actuels'!$C$24,0)","v":0},"N",{"$f":"IF(V11=\"o\",'2. Prix actuels'!$C$25,0)","v":0},"N",{"$f":"IF(X11=\"o\",F11*'2. Prix actuels'!$C$27/100,0)","v":0},"O",{"$f":"IF(Z11=\"o\",F11*'2. Prix actuels'!$C$26/100,0)","v":1.8},1,0]
["Petit outillage manuel",9,1.42,"Tarière lourde",null,2600,{"$f":"IF(F12>0,F12*'2. Prix actuels'!$C$32/100,0)","v":130},{"$f":"IF(F12>0,'2. Prix actuels'!$C$30,0)","v":5},1200,6,0.8,{"$f":"IF('2. Prix actuels'!$B$11=\"Oui\",3,4)","v":4},{"$f":"_xlfn.IFS(L12=1,'2. Prix actuels'!$C$9,L12=2,'2. Prix actuels'!$C$10,L12=3,'2. Prix actuels'!$C$11,L12=4,'2. Prix actuels'!$C$12,L12<1,0)","v":3.5},0,{"$f":"_xlfn.IFS(N12=1,'2. Prix actuels'!$C$15,N12=2,'2. Prix actuels'!$C$16,N12=3,'2. Prix actuels'!$C$17,N12<1,0)","v":0},"O",{"$f":"IF(P12=\"o\",'2. Prix actuels'!$C$6,0)","v":55},"O",{"$f":"IF(R12=\"o\",IF('2. Prix actuels'!$C$21*F12/100<=6000,'2. Prix actuels'!$C$21*'4. Données de calcul'!F12/100,6000),0)","v":52},"N",{"$f":"IF(T12=\"o\",'2. Prix actuels'!$C$24,0)","v":0},"N",{"$f":"IF(V12=\"o\",'2. Prix actuels'!$C$25,0)","v":0},"N",{"$f":"IF(X12=\"o\",F12*'2. Prix actuels'!$C$27/100,0)","v":0},"O",{"$f":"IF(Z12=\"o\",F12*'2. Prix actuels'!$C$26/100,0)","v":5.2},1.5,0]
["Petit outillage manuel",10,1.51,"Ecorceuse \"Eder\" avec moteur de tronçonneuse",null,2000,{"$f":"IF(F13>0,F13*'2. Prix actuels'!$C$32/100,0)","v":100},{"$f":"IF(F13>0,'2. Prix actuels'!$C$30,0)","v":5},1200,5,0.9,{"$f":"IF('2. Prix actuels'!$B$11=\"Oui\",3,4)","v":4},{"$f":"_xlfn.IFS(L13=1,'2. Prix actuels'!$C$9,L13=2,'2. Prix actuels'!$C$10,L13=3,'2. Prix actuels'!$C$11,L13=4,'2. Prix actuels'!$C$12,L13<1,0)","v":3.5},0,{"$f":"_xlfn.IFS(N13=1,'2. Prix actuels'!$C$15,N13=2,'2. Prix actuels'!$C$16,N13=3,'2. Prix actuels'!$C$17,N13<1,0)","v":0},"O",{"$f":"IF(P13=\"o\",'2. Prix actuels'!$C$6,0)","v":55},"O",{"$f":"IF(R13=\"o\",IF('2. Prix actuels'!$C$21*F13/100<=6000,'2. Prix actuels'!$C$21*'4. Données de calcul'!F13/100,6000),0)","v":40},"N",{"$f":"IF(T13=\"o\",'2. Prix actuels'!$C$24,0)","v":0},"N",{"$f":"IF(V13=\"o\",'2. Prix actuels'!$C$25,0)","v":0},"N",{"$f":"IF(X13=\"o\",F13*'2. Prix actuels'!$C$27/100,0)","v":0},"O",{"$f":"IF(Z13=\"o\",F13*'2. Prix actuels'!$C$26/100,0)","v":4},1.5,0]
["Petit outillage manuel",11,1.52,"Ecorceuse \"Biber\" avec moteur de tronçonneuse",null,3200,{"$f":"IF(F14>0,F14*'2. Prix actuels'!$C$32/100,0)","v":160},{"$f":"IF(F14>0,'2. Prix actuels'!$C$30,0)","v":5},1200,5,0.9,{"$f":"IF('2. Prix actuels'!$B$11=\"Oui\",3,4)","v":4},{"$f":"_xlfn.IFS(L14=1,'2. Prix actuels'!$C$9,L14=2,'2. Prix actuels'!$C$10,L14=3,'2. Prix actuels'!$C$11,L14=4,'2. Prix actuels'!$C$12,L14<1,0)","v":3.5},0,{"$f":"_xlfn.IFS(N14=1,'2. Prix actuels'!$C$15,N14=2,'2. Prix actuels'!$C$16,N14=3,'2. Prix actuels'!$C$17,N14<1,0)","v":0},"O",{"$f":"IF(P14=\"o\",'2. Prix actuels'!$C$6,0)","v":55},"O",{"$f":"IF(R14=\"o\",IF('2. Prix actuels'!$C$21*F14/100<=6000,'2. Prix actuels'!$C$21*'4. Données de calcul'!F14/100,6000),0)","v":64},"N",{"$f":"IF(T14=\"o\",'2. Prix actuels'!$C$24,0)","v":0},"N",{"$f":"IF(V14=\"o\",'2. Prix actuels'!$C$25,0)","v":0},"N",{"$f":"IF(X14=\"o\",F14*'2. Prix actuels'!$C$27/100,0)","v":0},"O",{"$f":"IF(Z14=\"o\",F14*'2. Prix actuels'!$C$26/100,0)","v":6.4},1.5,0]
["Tracteur et équipement",12,2.11,"Transporteur forestier (sans 2.4/2.5) moyen",30,58000,{"$f":"IF(F15>0,F15*'2. Prix actuels'!$C$32/100,0)","v":2900},{"$f":"IF(F15>0,'2. Prix actuels'!$C$30,0)","v":5},7000,7,1.1000000000000001,1,{"$f":"_xlfn.IFS(L15=1,'2. Prix actuels'!$C$9,L15=2,'2. Prix actuels'!$C$10,L15=3,'2. Prix actuels'!$C$11,L15=4,'2. Prix actuels'!$C$12,L15<1,0)","v":1.65},1,{"$f":"_xlfn.IFS(N15=1,'2. Prix actuels'!$C$15,N15=2,'2. Prix actuels'!$C$16,N15=3,'2. Prix actuels'!$C$17,N15<1,0)","v":6.5},"O",{"$f":"IF(P15=\"o\",'2. Prix actuels'!$C$6,0)","v":55},"O",{"$f":"IF(R15=\"o\",IF('2. Prix actuels'!$C$21*F15/100<=6000,'2. Prix actuels'!$C$21*'4. Données de calcul'!F15/100,6000),0)","v":1160},"O",{"$f":"IF(T15=\"o\",'2. Prix actuels'!$C$24,0)","v":100},"O",{"$f":"IF(V15=\"o\",'2. Prix actuels'!$C$25,0)","v":290},"O",{"$f":"IF(X15=\"o\",F15*'2. Prix actuels'!$C$27/100,0)","v":1624},"N",{"$f":"IF(Z15=\"o\",F15*'2. Prix actuels'!$C$26/100,0)","v":0},3.6,0.12]
{"$rows_left_out":60}
{"sheet":"5. Granph. frais totaux","index":4,"n_rows":14,"n_cols":3,"rows_kept":14,"cut":false,"hidden":false,"merged":[]}
[]
[null,"Propriétaire :",{"$f":"'2. Prix actuels'!C1","v":0}]
[]
["Frais totaux de l'ensemble des machines sélectionnées"]
[]
[{"$f":"INDEX('4. Données de calcul'!$D$4:$D$74,MATCH('3. Coûts des machines'!$D$3,'4. Données de calcul'!$B$4:$B$74))","v":"Sélectionnez un objet"}]
[{"$f":"INDEX('4. Données de calcul'!$D$4:$D$74,MATCH('3. Coûts des machines'!$E$3,'4. Données de calcul'!$B$4:$B$74))","v":"Sélectionnez un objet"}]
[{"$f":"INDEX('4. Données de calcul'!$D$4:$D$74,MATCH('3. Coûts des machines'!$F$3,'4. Données de calcul'!$B$4:$B$74))","v":"Sélectionnez un objet"}]
[{"$f":"INDEX('4. Données de calcul'!$D$4:$D$74,MATCH('3. Coûts des machines'!$G$3,'4. Données de calcul'!$B$4:$B$74))","v":"Sélectionnez un objet"}]
[]
["Frais fixes annuels",{"$f":"'3. Coûts des machines'!H35","v":0}]
["Frais variables par heure d'utilisation",{"$f":"'3. Coûts des machines'!H46","v":0}]
["Coût de revient total par heure d'utilisation",{"$f":"'3. Coûts des machines'!$H$53","v":0}]
["Taux d'indemnisation (10% de suppl. risque)",{"$f":"'3. Coûts des machines'!$H$62","v":0}]

{"sheet":"6. Graph. frais fixes et vari.","index":5,"n_rows":9,"n_cols":5,"rows_kept":9,"cut":false,"hidden":false,"merged":[]}
[]
[null,null,"Propriétaire :",{"$f":"'2. Prix actuels'!C1","v":0}]
[]
[null,"Calcul des frais des machines sélectionnées"]
[null,null,null,"Frais fixes","Frais variable"]
[1,{"$f":"INDEX('4. Données de calcul'!$D$4:$D$74,MATCH('3. Coûts des machines'!$D$3,'4. Données de calcul'!$B$4:$B$74))","v":"Sélectionnez un objet"},null,{"$f":"'3. Coûts des machines'!D35","v":0},{"$f":"'3. Coûts des machines'!D46","v":0}]
[2,{"$f":"INDEX('4. Données de calcul'!$D$4:$D$74,MATCH('3. Coûts des machines'!$E$3,'4. Données de calcul'!$B$4:$B$74))","v":"Sélectionnez un objet"},null,{"$f":"'3. Coûts des machines'!E35","v":0},{"$f":"'3. Coûts des machines'!E46","v":0}]
[3,{"$f":"INDEX('4. Données de calcul'!$D$4:$D$74,MATCH('3. Coûts des machines'!$F$3,'4. Données de calcul'!$B$4:$B$74))","v":"Sélectionnez un objet"},null,{"$f":"'3. Coûts des machines'!F35","v":0},{"$f":"'3. Coûts des machines'!F46","v":0}]
[4,{"$f":"INDEX('4. Données de calcul'!$D$4:$D$74,MATCH('3. Coûts des machines'!$G$3,'4. Données de calcul'!$B$4:$B$74))","v":"Sélectionnez un objet"},null,{"$f":"'3. Coûts des machines'!G35","v":0},{"$f":"'3. Coûts des machines'!G46","v":0}]

{"sheet":"7. Graph. coûts horaires","index":6,"n_rows":99,"n_cols":6,"rows_kept":99,"cut":false,"hidden":false,"merged":[]}
[]
[null,"Propriétaire :",{"$f":"'2. Prix actuels'!C1","v":0}]
[]
["Calcul de revient par heure d'utilisation"]
[]
[{"$f":"INDEX('4. Données de calcul'!$D$4:$D$74,MATCH('3. Coûts des machines'!$D$3,'4. Données de calcul'!$B$4:$B$74))","v":"Sélectionnez un objet"}]
[{"$f":"INDEX('4. Données de calcul'!$D$4:$D$74,MATCH('3. Coûts des machines'!$E$3,'4. Données de calcul'!$B$4:$B$74))","v":"Sélectionnez un objet"}]
[{"$f":"INDEX('4. Données de calcul'!$D$4:$D$74,MATCH('3. Coûts des machines'!$F$3,'4. Données de calcul'!$B$4:$B$74))","v":"Sélectionnez un objet"}]
[{"$f":"INDEX('4. Données de calcul'!$D$4:$D$674,MATCH('3. Coûts des machines'!$G$3,'4. Données de calcul'!$B$4:$B$74))","v":"Sélectionnez un objet"}]
[]
[]
[]
[]
[]
[]
{"$rows_left_out":84}