{"text_format":"1","workbook":"xlsx","n_sheets":7,"sheets":["1. Explications","2. Prix actuels","3. Coûts des machines","4. Données de calcul","5. Granph. frais totaux","6. Graph. frais fixes et vari.","7. Graph. coûts horaires"],"not_rendered":{"charts":5,"images":3,"macros":0,"external_links":0,"defined_names":4,"comments":1,"pivot_tables":0},"unopened":[],"bounds":{"document_bytes":16777216,"sheet_cells":100000,"rows_first":2000,"rows_last":500,"rows_between":2000,"halvings":0,"cell_chars":16384,"cell_head_chars":4096},"cells_cut":0,"cells_raw":0,"read":"whole","date_system":"1900"}

{"sheet":"1. Explications","index":0,"n_rows":0,"n_cols":0,"rows_kept":0,"cut":false,"hidden":false,"merged":[]}

{"sheet":"2. Prix actuels","index":1,"n_rows":34,"n_cols":3,"rows_kept":34,"cut":false,"hidden":false,"merged":[]}
[]
[null,"Propriétaire :","Commune de Tully"]
["Taux et prix actuels",null,2020]
[]
["Salaires:"]
["Machiniste",null,55]
[]
["Carburant, par litre:"]
["Diesel",null,1.65]
["Essence (sans plomb)",null,1.6]
["Essence 2 temps","Non",1.74]
["Essence sans benzène",{"$f":"IF(B11=\"Non\",\"Oui\",\"Non\")","v":"Oui"},3.5]
[]
["Lubrifiant, par litre:"]
["Huile de moteur",null,6.5]
["Mélange 2-temps ",null,6.9]
["Huile de chaîne bio ",null,5.2]
[]
["Charges d'immeubles:"]
[]
["en % du prix d'achat",null,2]
[]
["Taxes et assurances:"]
["Taxes",null,100]
["Responsabilité civile",null,290]
["Assurance incendie en % du prix d'achat",null,0.2]
["Casco complète en % du prix d'achat",null,2.8]
[]
[]
["Taux d'intérêts:",null,5]
[]
["Valeur de liquidation:",null,5]
[]
["Supplément pour bénéfice et risque:",null,20]

{"sheet":"3. Coûts des machines","index":2,"n_rows":115,"n_cols":8,"rows_kept":115,"cut":false,"hidden":false,"merged":[]}
[null,"Coût des machines",null,"Propriétaire :",{"$f":"'2. Prix actuels'!C2","v":"Commune de Tully"}]
[null,null,null,"Objet 1","Objet 2","Objet 3","Objet 4"]
[null,"Machine",null,71,71,71,71,"Totale"]
[null,"Numéro",null,{"$f":"INDEX('4. Données de calcul'!$C$4:$C$75,MATCH(D$3,'4. Données de calcul'!$B$4:$B$75,0))","v":0},{"$f":"INDEX('4. Données de calcul'!$C$4:$C$75,MATCH(E$3,'4. Données de calcul'!$B$4:$B$75,0))","v":0},{"$f":"INDEX('4. Données de calcul'!$C$4:$C$75,MATCH(F$3,'4. Données de calcul'!$B$4:$B$75,0))","v":0},{"$f":"INDEX('4. Données de calcul'!$C$4:$C$75,MATCH(G$3,'4. Données de calcul'!$B$4:$B$75,0))","v":0}]
[null,"Puissance en kW",null,{"$f":"INDEX('4. Données de calcul'!$E$4:$E$75,MATCH(D$3,'4. Données de calcul'!$B$4:$B$75,0))","v":0},{"$f":"INDEX('4. Données de calcul'!$E$4:$E$75,MATCH(E$3,'4. Données de calcul'!$B$4:$B$75,0))","v":0},{"$f":"INDEX('4. Données de calcul'!$E$4:$E$75,MATCH(F$3,'4. Données de calcul'!$B$4:$B$75,0))","v":0},{"$f":"INDEX('4. Données de calcul'!$E$4:$E$75,MATCH(G$3,'4. Données de calcul'!$B$4:$B$75,0))","v":0}]
[null,"Utilisation annuelle en heure",null,250,350,350,250]
[null,"Prix d'achat","P",{"$f":"INDEX('4. Données de calcul'!$F$4:$F$75,MATCH(D$3,'4. Données de calcul'!$B$4:$B$75,0))","v":0},{"$f":"INDEX('4. Données de calcul'!$F$4:$F$75,MATCH(E$3,'4. Données de calcul'!$B$4:$B$75,0))","v":0},{"$f":"INDEX('4. Données de calcul'!$F$4:$F$75,MATCH(F$3,'4. Données de calcul'!$B$4:$B$75,0))","v":0},{"$f":"INDEX('4. Données de calcul'!$F$4:$F$75,MATCH(G$3,'4. Données de calcul'!$B$4:$B$75,0))","v":0},{"$f":"SUM(D7:G7)","v":0}]
[null,"Valeur de liquidation","L",{"$f":"INDEX('4. Données de calcul'!G$4:G$75,MATCH(D$3,'4. Données de calcul'!$B$4:$B$75,0))","v":0},{"$f":"INDEX('4. Données de calcul'!G$4:G$75,MATCH(E$3,'4. Données de calcul'!$B$4:$B$75,0))","v":0},{"$f":"INDEX('4. Données de calcul'!G$4:G$75,MATCH(F$3,'4. Données de calcul'!$B$4:$B$75,0))","v":0},{"$f":"INDEX('4. Données de calcul'!G$4:G$75,MATCH(G$3,'4. Données de calcul'!$B$4:$B$75,0))","v":0},{"$f":"SUM(D8:G8)","v":0}]
[null,"Taux d'intérêts","T",{"$f":"INDEX('4. Données de calcul'!$H$4:$H$75,MATCH(D$3,'4. Données de calcul'!$B$4:$B$75,0))","v":0},{"$f":"INDEX('4. Données de calcul'!$H$4:$H$75,MATCH(E$3,'4. Données de calcul'!$B$4:$B$75,0))","v":0},{"$f":"INDEX('4. Données de calcul'!$H$4:$H$75,MATCH(F$3,'4. Données de calcul'!$B$4:$B$75,0))","v":0},{"$f":"INDEX('4. Données de calcul'!$H$4:$H$75,MATCH(G$3,'4. Données de calcul'!$B$4:$B$75,0))","v":0}]
[null,"Durée d'utilisation en heures","H",{"$f":"INDEX('4. Données de calcul'!$I$4:$I$75,MATCH(D$3,'4. Données de calcul'!$B$4:$B$75,0))","v":0},{"$f":"INDEX('4. Données de calcul'!$I$4:$I$75,MATCH(E$3,'4. Données de calcul'!$B$4:$B$75,0))","v":0},{"$f":"INDEX('4. Données de calcul'!$I$4:$I$75,MATCH(F$3,'4. Données de calcul'!$B$4:$B$75,0))","v":0},{"$f":"INDEX('4. Données de calcul'!$I$4:$I$75,MATCH(G$3,'4. Données de calcul'!$B$4:$B$75,0))","v":0}]
[null,"Durée d'utilisation en années","D",{"$f":"INDEX('4. Données de calcul'!$J$4:$J$75,MATCH(D$3,'4. Données de calcul'!$B$4:$B$75,0))","v":0},{"$f":"INDEX('4. Données de calcul'!$J$4:$J$75,MATCH(E$3,'4. Données de calcul'!$B$4:$B$75,0))","v":0},{"$f":"INDEX('4. Données de calcul'!$J$4:$J$75,MATCH(F$3,'4. Données de calcul'!$B$4:$B$75,0))","v":0},{"$f":"INDEX('4. Données de calcul'!$J$4:$J$75,MATCH(G$3,'4. Données de calcul'!$B$4:$B$75,0))","v":0}]
[null,"Durée d'utilisation en années (effective)","D",{"$f":"IF(D10/D6>D11,D11,D10/D6)","v":0},{"$f":"IF(E10/E6>E11,E11,E10/E6)","v":0},{"$f":"IF(F10/F6>F11,F11,F10/F6)","v":0},{"$f":"IF(G10/G6>G11,G11,G10/G6)","v":0}]
[null,"Facteur de réparation","R",{"$f":"INDEX('4. Données de calcul'!$K$4:$K$75,MATCH(D$3,'4. Données de calcul'!$B$4:$B$75,0))","v":0},{"$f":"INDEX('4. Données de calcul'!$K$4:$K$75,MATCH(E$3,'4. Données de calcul'!$B$4:$B$75,0))","v":0},{"$f":"INDEX('4. Données de calcul'!$K$4:$K$75,MATCH(F$3,'4. Données de calcul'!$B$4:$B$75,0))","v":0},{"$f":"INDEX('4. Données de calcul'!$K$4:$K$75,MATCH(G$3,'4. Données de calcul'!$B$4:$B$75,0))","v":0}]
[null,"Prix du carburant","C",{"$f":"INDEX('4. Données de calcul'!$M$4:$M$75,MATCH(D$3,'4. Données de calcul'!$B$4:$B$75,0))","v":0},{"$f":"INDEX('4. Données de calcul'!$M$4:$M$75,MATCH(E$3,'4. Données de calcul'!$B$4:$B$75,0))","v":0},{"$f":"INDEX('4. Données de calcul'!$M$4:$M$75,MATCH(F$3,'4. Données de calcul'!$B$4:$B$75,0))","v":0},{"$f":"INDEX('4. Données de calcul'!$M$4:$M$75,MATCH(G$3,'4. Données de calcul'!$B$4:$B$75,0))","v":0}]
[null,"Prix du lubrifiant","L",{"$f":"INDEX('4. Données de calcul'!$O$4:$O$75,MATCH(D$3,'4. Données de calcul'!$B$4:$B$75,0))","v":0},{"$f":"INDEX('4. Données de calcul'!$O$4:$O$75,MATCH(E$3,'4. Données de calcul'!$B$4:$B$75,0))","v":0},{"$f":"INDEX('4. Données de calcul'!$O$4:$O$75,MATCH(F$3,'4. Données de calcul'!$B$4:$B$75,0))","v":0},{"$f":"INDEX('4. Données de calcul'!$O$4:$O$75,MATCH(G$3,'4. Données de calcul'!$B$4:$B$75,0))","v":0}]
[null,"Salaires","S",{"$f":"INDEX('4. Données de calcul'!$Q$4:$Q$75,MATCH(D$3,'4. Données de calcul'!$B$4:$B$75,0))","v":0},{"$f":"INDEX('4. Données de calcul'!$Q$4:$Q$75,MATCH(E$3,'4. Données de calcul'!$B$4:$B$75,0))","v":0},{"$f":"INDEX('4. Données de calcul'!$Q$4:$Q$75,MATCH(F$3,'4. Données de calcul'!$B$4:$B$75,0))","v":0},{"$f":"INDEX('4. Données de calcul'!$Q$4:$Q$75,MATCH(G$3,'4. Données de calcul'!$B$4:$B$75,0))","v":0}]
[null,"Plaque immatriculation, impôts","PI",{"$f":"INDEX('4. Données de calcul'!$U$4:$U$75,MATCH(D$3,'4. Données de calcul'!$B$4:$B$75,0))","v":0},{"$f":"INDEX('4. Données de calcul'!$U$4:$U$75,MATCH(E$3,'4. Données de calcul'!$B$4:$B$75,0))","v":0},{"$f":"INDEX('4. Données de calcul'!$U$4:$U$75,MATCH(F$3,'4. Données de calcul'!$B$4:$B$75,0))","v":0},{"$f":"INDEX('4. Données de calcul'!$U$4:$U$75,MATCH(G$3,'4. Données de calcul'!$B$4:$B$75,0))","v":0},{"$f":"SUM(D17:G17)","v":0}]
[null,"Responsabilité civile","RC",{"$f":"INDEX('4. Données de calcul'!$W$4:$W$75,MATCH(D$3,'4. Données de calcul'!$B$4:$B$75,0))","v":0},{"$f":"INDEX('4. Données de calcul'!$W$4:$W$75,MATCH(E$3,'4. Données de calcul'!$B$4:$B$75,0))","v":0},{"$f":"INDEX('4. Données de calcul'!$W$4:$W$75,MATCH(F$3,'4. Données de calcul'!$B$4:$B$75,0))","v":0},{"$f":"INDEX('4. Données de calcul'!$W$4:$W$75,MATCH(G$3,'4. Données de calcul'!$B$4:$B$75,0))","v":0},0]
[null,"Assurance incendie","IN",{"$f":"INDEX('4. Données de calcul'!$AA$4:$AA$75,MATCH(D$3,'4. Données de calcul'!$B$4:$B$75,0))","v":0},{"$f":"INDEX('4. Données de calcul'!$AA$4:$AA$75,MATCH(E$3,'4. Données de calcul'!$B$4:$B$75,0))","v":0},{"$f":"INDEX('4. Données de calcul'!$AA$4:$AA$75,MATCH(F$3,'4. Données de calcul'!$B$4:$B$75,0))","v":0},{"$f":"INDEX('4. Données de calcul'!$AA$4:$AA$75,MATCH(G$3,'4. Données de calcul'!$B$4:$B$75,0))","v":0},0]
[null,"Casco partielle/complète","CC",{"$f":"INDEX('4. Données de calcul'!$Y$4:$Y$75,MATCH(D$3,'4. Données de calcul'!$B$4:$B$75,0))","v":0},{"$f":"INDEX('4. Données de calcul'!$Y$4:$Y$75,MATCH(E$3,'4. Données de calcul'!$B$4:$B$75,0))","v":0},{"$f":"INDEX('4. Données de calcul'!$Y$4:$Y$75,MATCH(F$3,'4. Données de calcul'!$B$4:$B$75,0))","v":0},{"$f":"INDEX('4. Données de calcul'!$Y$4:$Y$75,MATCH(G$3,'4. Données de calcul'!$B$4:$B$75,0))","v":0},0]
[null,{"$f":"IF(OR(D21>0,E21>0,F21>0,G21>0),\"Consomm. carburant par H d'utilisation\",)","v":0},null,{"$f":"INDEX('4. Données de calcul'!$AB$4:$AB$75,MATCH(D$3,'4. Données de calcul'!$B$4:$B$75,0))","v":0},{"$f":"INDEX('4. Données de calcul'!$AB$4:$AB$75,MATCH(E$3,'4. Données de calcul'!$B$4:$B$75,0))","v":0},{"$f":"INDEX('4. Données de calcul'!$AB$4:$AB$75,MATCH(F$3,'4. Données de calcul'!$B$4:$B$75,0))","v":0},{"$f":"INDEX('4. Données de calcul'!$AB$4:$AB$75,MATCH(G$3,'4. Données de calcul'!$B$4:$B$75,0))","v":0},0]
[null,{"$f":"IF(OR(D22>0,E22>0,F22>0,G22>0),\"Consomm. lubrifiant par H d'utilisation\",)","v":0},null,{"$f":"INDEX('4. Données de calcul'!$AC$4:$AC$75,MATCH(D$3,'4. Données de calcul'!$B$4:$B$75,0))","v":0},{"$f":"INDEX('4. Données de calcul'!$AC$4:$AC$75,MATCH(E$3,'4. Données de calcul'!$B$4:$B$75,0))","v":0},{"$f":"INDEX('4. Données de calcul'!$AC$4:$AC$75,MATCH(F$3,'4. Données de calcul'!$B$4:$B$75,0))","v":0},{"$f":"INDEX('4. Données de calcul'!$AC$4:$AC$75,MATCH(G$3,'4. Données de calcul'!$B$4:$B$75,0))","v":0},0]
[]
[]
[null,"2. FRAIS FIXES, par année"]
[]
[null,"Amortissement",null,{"$f":"IF(D7>0,(D7-D8)/D12,0)","v":0},{"$f":"IF(E7>0,(E7-E8)/E12,0)","v":0},{"$f":"IF(F7>0,(F7-F8)/F12,0)","v":0},{"$f":"IF(G7>0,(G7-G8)/G12,0)","v":0},{"$f":"SUM(D27:G27)","v":0}]
[null,"Intérêt (0.6 x P x T)",null,{"$f":"(D7*D9*0.6)/100","v":0},{"$f":"(E7*E9*0.6)/100","v":0},{"$f":"(F7*F9*0.6)/100","v":0},{"$f":"(G7*G9*0.6)/100","v":0},0]
[null,{"$f":"\"Charges d'immeubles (\"&'2. Prix actuels'!C21&\" % von P, max. 6000.- / Jahr)\"","v":"Charges d'immeubles (2 % von P, max. 6000.- / Jahr)"},null,{"$f":"INDEX('4. Données de calcul'!$S$4:$S$75,MATCH(D$3,'4. Données de calcul'!$B$4:$B$75,0))","v":0},{"$f":"INDEX('4. Données de calcul'!$S$4:$S$75,MATCH(E$3,'4. Données de calcul'!$B$4:$B$75,0))","v":0},{"$f":"INDEX('4. Données de calcul'!$S$4:$S$75,MATCH(F$3,'4. Données de calcul'!$B$4:$B$75,0))","v":0},{"$f":"INDEX('4. Données de calcul'!$S$4:$S$75,MATCH(G$3,'4. Données de calcul'!$B$4:$B$75,0))","v":0},0]
[null,"Plaque du véhicule, impôts",null,{"$f":"D17","v":0},0,0,0,0]
[null,"Responsabilité civile",null,0,0,0,0,0]
[null,"Assurance incendie",null,0,0,0,0,0]
[null,"Casco partielle ou complète",null,0,0,0,0,0]
[]
[null,"Total frais fixes",null,{"$f":"SUM(D27:D33)","v":0},{"$f":"SUM(E27:E33)","v":0},{"$f":"SUM(F27:F33)","v":0},{"$f":"SUM(G27:G33)","v":0},{"$f":"SUM(D35:G35)","v":0}]
[]
[]
[null,"3. FRAIS VARIABLES. par heure d'utilisation"]
[]
[null," "]
[null,"Carburant",null,{"$f":"D14*D21","v":0},0,0,0,{"$f":"SUM(D41:G41)","v":0}]
[null,"Lubrifiant",null,0,{"$f":"E15*E22","v":0},0,0,{"$f":"SUM(D42:G42)","v":0}]
[null,"Coût de personnel (5%  à 10% de S)",null,{"$f":"IF(D3<=11,0.1*D16,0.05*D16)","v":0},{"$f":"IF(E3<=11,0.1*E16,0.05*E16)","v":0},{"$f":"IF(F3<=11,0.1*F16,0.05*F16)","v":0},{"$f":"IF(G3<=11,0.1*G16,0.05*G16)","v":0},{"$f":"SUM(D43:G43)","v":0}]
[null,"Réparations (P:H) x R",null,{"$f":"IF(D7>0,D7/D10*D13,0)","v":0},{"$f":"IF(E7>0,E7/E10*E13,0)","v":0},{"$f":"IF(F7>0,F7/F10*F13,0)","v":0},{"$f":"IF(G7>0,G7/G10*G13,0)","v":0},{"$f":"SUM(D44:G44)","v":0}]
[]
[null,"Total frais variables",null,{"$f":"SUM(D41:D45)","v":0},{"$f":"SUM(E41:E45)","v":0},{"$f":"SUM(F41:F45)","v":0},{"$f":"SUM(G41:G45)","v":0},{"$f":"SUM(D46:G46)","v":0}]
[]
[]
[null,"4. COUTS DE REVIENT unitaires"]
[]
[null,"Pour une utilisation annuelle de:",null,{"$f":"D6","v":250},{"$f":"E6","v":350},{"$f":"F6","v":350},{"$f":"G6","v":250}]
[]
[null,"Coût de revient par heure d'utilisation",null,{"$f":"(D35/D6)+D46","v":0},{"$f":"(E35/E6)+E46","v":0},{"$f":"(F35/F6)+F46","v":0},{"$f":"(G35/G6)+G46","v":0},{"$f":"SUM(D53:G53)","v":0}]
[null,{"$f":"IF(OR($D$3<=11,$E$3<=11,$F$3<=11,$G$3<=11),\"Coût de revient par litre\",)","v":0},null,{"$f":"IF(D3<=11,D53/D21,\"\")","v":""},{"$f":"IF(E3<=11,E53/E21,\"\")","v":""},{"$f":"IF(F3<=11,F53/F21,\"\")","v":""},{"$f":"IF(G3<=11,G53/G21,\"\")","v":""}]
[]
[null,"5. TAUX D'INDEMNISATION"]
[]
[null,"Coût de revient par heure d'utilisation",null,{"$f":"D53","v":0},0,0,0,{"$f":"SUM(D58:G58)","v":0}]
[null,"Coût de revient par litre",null,"","","",""]
[null,{"$f":"\"+\"&'2. Prix actuels'!C34&\"% de supplément pour bénéfice et risque\"","v":"+20% de supplément pour bénéfice et risque"},null,{"$f":"D58*'2. Prix actuels'!$C$34/100","v":0},{"$f":"E58*'2. Prix actuels'!$C$34/100","v":0},{"$f":"F58*'2. Prix actuels'!$C$34/100","v":0},{"$f":"G58*'2. Prix actuels'!$C$34/100","v":0},{"$f":"SUM(D60:G60)","v":0}]
[]
[null,"Taux d'indemnisation par \"H\" d'utilisation",null,{"$f":"D58+D60","v":0},{"$f":"E58+E60","v":0},{"$f":"F58+F60","v":0},{"$f":"G58+G60","v":0},{"$f":"SUM(D62:G62)","v":0}]
[null,{"$f":"IF(OR($D$3<=11,$E$3<=11,$F$3<=11,$G$3<=11),\"Taux d'indemnisation par litre\",)","v":0},null,{"$f":"IF(D3<=11,D59+D60,\"\")","v":""},{"$f":"IF(E3<=11,E59+E60,\"\")","v":""},{"$f":"IF(F3<=11,F59+F60,\"\")","v":""},{"$f":"IF(G3<=11,G59+G60,\"\")","v":""}]
[]
[]
[]
[]
[]
[]
[]
[]
[]
[]
[]
[]
[]
[]
[]
[]
[null,"Diagramm-Daten"]
[null,null,null,{"$f":"INDEX('4. Données de calcul'!$D$4:$D$74,MATCH('3. Coûts des machines'!D$3,'4. Données de calcul'!$B$4:$B$74))","v":"Sélectionnez un objet"},{"$f":"INDEX('4. Données de calcul'!$D$4:$D$74,MATCH('3. Coûts des machines'!E$3,'4. Données de calcul'!$B$4:$B$74))","v":"Sélectionnez un objet"},{"$f":"INDEX('4. Données de calcul'!$D$4:$D$74,MATCH('3. Coûts des machines'!F$3,'4. Données de calcul'!$B$4:$B$74))","v":"Sélectionnez un objet"},{"$f":"INDEX('4. Données de calcul'!$D$4:$D$74,MATCH('3. Coûts des machines'!G$3,'4. Données de calcul'!$B$4:$B$74))","v":"Sélectionnez un objet"},"Total"]
[null,"Amortissement",null,{"$f":"D27","v":0},0,0,0,0]
[null,"Intérêts",null,0,0,0,0,0]
[null,"Immeubles",null,0,0,0,0,0]
[null,"Plaque, impôts",null,0,0,0,0,0]
[null,"RC",null,0,0,0,0,0]
[null,"Ass. incendie",null,0,0,0,0,0]
[null,"Casco complète",null,0,0,0,0,0]
[]
[null,"Carburant",null,{"$f":"D41","v":0},0,0,0,0]
[null,"Lubrifiant",null,0,0,0,0,0]
[null,"Entretien",null,0,0,0,0,0]
[null,"Réparations",null,0,0,0,0,0]
[]
[null,"Selbstkosten pro Betriebsstunde",null,{"$f":"D53","v":0},{"$f":"E53","v":0},{"$f":"F53","v":0},{"$f":"G53","v":0},{"$f":"H53","v":0}]
[]
[null,100,null,{"$f":"(D$35/$B97)+D$46","v":0},0,0,0,0]
[null,150,null,0,0,0,0,0]
[null,200,null,0,0,0,0,0]
[null,250,null,0,0,0,0,0]
[null,300,null,0,0,0,0,0]
[null,350,null,0,0,0,0,0]
[null,400,null,0,0,0,0,0]
[null,450,null,0,0,0,0,0]
[null,500,null,0,0,0,0,0]
[null,550,null,0,0,0,0,0]
[null,600,null,{"$f":"(D$35/$B107)+D$46","v":0},0,0,0,0]
[null,650,null,0,0,0,0,0]
[null,700,null,0,0,0,0,0]
[null,750,null,0,0,0,0,0]
[null,800,null,0,0,0,0,0]
[null,850,null,0,0,0,0,0]
[null,900,null,0,0,0,0,0]
[null,950,null,0,0,0,0,0]
[null,1000,null,0,0,0,0,0]

{"sheet":"4. Données de calcul","index":3,"n_rows":74,"n_cols":29,"rows_kept":74,"cut":false,"hidden":false,"merged":[]}
[null,null,null,null,null,null,null,null,null,null,null,"Prix carburant et lubrifiant",null,null,null,null,null,null,null,"Taxes et assurances",null,null,null,null,null,null,null,"Consommation"]
["Données"]
["Catégorie","Nr","No.","Description de la machine","kW","Prix d'achat","Valeur de\nliquidaion","Taux\nd'intérêts","Durée d'utililisation\nmaximum en heures","Durée d'utilisation\nmaximum en années","Facteur\nréparation","G.","Carburant","G.","Lubrifiant","O/N","Salaires","O/N","Charges\nd'immeubles","O/N","Plaque/impôts","O/N","RC","O/N","Casco","O/N","Assurance\nincendie","Carburant l/h","Lubrifiant l/h"]
["Petit outillage manuel",1,1.1100000000000001,"Tronçonneuse légère"," ",1100,{"$f":"IF(F4>0,F4*'2. Prix actuels'!$C$32/100,0)","v":55},{"$f":"IF(F4>0,'2. Prix actuels'!$C$30,0)","v":5},1200,3,1.2,{"$f":"IF('2. Prix actuels'!$B$11=\"Oui\",3,4)","v":4},{"$f":"_xlfn.IFS(L4=1,'2. Prix actuels'!$C$9,L4=2,'2. Prix actuels'!$C$10,L4=3,'2. Prix actuels'!$C$11,L4=4,'2. Prix actuels'!$C$12,L4<1,0)","v":3.5},3,{"$f":"_xlfn.IFS(N4=1,'2. Prix actuels'!$C$15,N4=2,'2. Prix actuels'!$C$16,N4=3,'2. Prix actuels'!$C$17,N4<1,0)","v":5.2},"O",{"$f":"IF(P4=\"o\",'2. Prix actuels'!$C$6,0)","v":55},"O",{"$f":"IF(R4=\"o\",IF('2. Prix actuels'!$C$21*F4/100<=6000,'2. Prix actuels'!$C$21*'4. Données de calcul'!F4/100,6000),0)","v":22},"N",{"$f":"IF(T4=\"o\",'2. Prix actuels'!$C$24,0)","v":0},"N",{"$f":"IF(V4=\"o\",'2. Prix actuels'!$C$25,0)","v":0},"N",{"$f":"IF(X4=\"o\",F4*'2. Prix actuels'!$C$27/100,0)","v":0},"O",{"$f":"IF(Z4=\"o\",F4*'2. Prix actuels'!$C$26/100,0)","v":2.2000000000000002},1,0.5]
["Petit outillage manuel",2,1.1200000000000001,"Tronçonneuse moyenne"," ",1650,{"$f":"IF(F5>0,F5*'2. Prix actuels'!$C$32/100,0)","v":82.5},{"$f":"IF(F5>0,'2. Prix actuels'!$C$30,0)","v":5},1200,3,1,{"$f":"IF('2. Prix actuels'!$B$11=\"Oui\",3,4)","v":4},{"$f":"_xlfn.IFS(L5=1,'2. Prix actuels'!$C$9,L5=2,'2. Prix actuels'!$C$10,L5=3,'2. Prix actuels'!$C$11,L5=4,'2. Prix actuels'!$C$12,L5<1,0)","v":3.5},3,{"$f":"_xlfn.IFS(N5=1,'2. Prix actuels'!$C$15,N5=2,'2. Prix actuels'!$C$16,N5=3,'2. Prix actuels'!$C$17,N5<1,0)","v":5.2},"O",{"$f":"IF(P5=\"o\",'2. Prix actuels'!$C$6,0)","v":55},"O",{"$f":"IF(R5=\"o\",IF('2. Prix actuels'!$C$21*F5/100<=6000,'2. Prix actuels'!$C$21*'4. Données de calcul'!F5/100,6000),0)","v":33},"N",{"$f":"IF(T5=\"o\",'2. Prix actuels'!$C$24,0)","v":0},"N",{"$f":"IF(V5=\"o\",'2. Prix actuels'!$C$25,0)","v":0},"N",{"$f":"IF(X5=\"o\",F5*'2. Prix actuels'!$C$27/100,0)","v":0},"O",{"$f":"IF(Z5=\"o\",F5*'2. Prix actuels'!$C$26/100,0)","v":3.3},1.5,0.75]
["Petit outillage manuel",3,1.1299999999999999,"Tronçonneuse lourde",null,2100,{"$f":"IF(F6>0,F6*'2. Prix actuels'!$C$32/100,0)","v":105},{"$f":"IF(F6>0,'2. Prix actuels'!$C$30,0)","v":5},1200,3,0.9,{"$f":"IF('2. Prix actuels'!$B$11=\"Oui\",3,4)","v":4},{"$f":"_xlfn.IFS(L6=1,'2. Prix actuels'!$C$9,L6=2,'2. Prix actuels'!$C$10,L6=3,'2. Prix actuels'!$C$11,L6=4,'2. Prix actuels'!$C$12,L6<1,0)","v":3.5},3,{"$f":"_xlfn.IFS(N6=1,'2. Prix actuels'!$C$15,N6=2,'2. Prix actuels'!$C$16,N6=3,'2. Prix actuels'!$C$17,N6<1,0)","v":5.2},"O",{"$f":"IF(P6=\"o\",'2. Prix actuels'!$C$6,0)","v":55},"O",{"$f":"IF(R6=\"o\",IF('2. Prix actuels'!$C$21*F6/100<=6000,'2. Prix actuels'!$C$21*'4. Données de calcul'!F6/100,6000),0)","v":42},"N",{"$f":"IF(T6=\"o\",'2. Prix actuels'!$C$24,0)","v":0},"N",{"$f":"IF(V6=\"o\",'2. Prix actuels'!$C$25,0)","v":0},"N",{"$f":"IF(X6=\"o\",F6*'2. Prix actuels'!$C$27/100,0)","v":0},"O",{"$f":"IF(Z6=\"o\",F6*'2. Prix actuels'!$C$26/100,0)","v":4.2},2,1]
["Petit outillage manuel",4,1.21,"Débroussailleuse légère",null,1100,{"$f":"IF(F7>0,F7*'2. Prix actuels'!$C$32/100,0)","v":55},{"$f":"IF(F7>0,'2. Prix actuels'!$C$30,0)","v":5},1200,4,0.6,{"$f":"IF('2. Prix actuels'!$B$11=\"Oui\",3,4)","v":4},{"$f":"_xlfn.IFS(L7=1,'2. Prix actuels'!$C$9,L7=2,'2. Prix actuels'!$C$10,L7=3,'2. Prix actuels'!$C$11,L7=4,'2. Prix actuels'!$C$12,L7<1,0)","v":3.5},0,{"$f":"_xlfn.IFS(N7=1,'2. Prix actuels'!$C$15,N7=2,'2. Prix actuels'!$C$16,N7=3,'2. Prix actuels'!$C$17,N7<1,0)","v":0},"O",{"$f":"IF(P7=\"o\",'2. Prix actuels'!$C$6,0)","v":55},"O",{"$f":"IF(R7=\"o\",IF('2. Prix actuels'!$C$21*F7/100<=6000,'2. Prix actuels'!$C$21*'4. Données de calcul'!F7/100,6000),0)","v":22},"N",{"$f":"IF(T7=\"o\",'2. Prix actuels'!$C$24,0)","v":0},"N",{"$f":"IF(V7=\"o\",'2. Prix actuels'!$C$25,0)","v":0},"N",{"$f":"IF(X7=\"o\",F7*'2. Prix actuels'!$C$27/100,0)","v":0},"O",{"$f":"IF(Z7=\"o\",F7*'2. Prix actuels'!$C$26/100,0)","v":2.2000000000000002},1,0]
["Petit outillage manuel",5,1.22,"Débroussailleuse moyenne",null,1450,{"$f":"IF(F8>0,F8*'2. Prix actuels'!$C$32/100,0)","v":72.5},{"$f":"IF(F8>0,'2. Prix actuels'!$C$30,0)","v":5},1200,4,0.6,{"$f":"IF('2. Prix actuels'!$B$11=\"Oui\",3,4)","v":4},{"$f":"_xlfn.IFS(L8=1,'2. Prix actuels'!$C$9,L8=2,'2. Prix actuels'!$C$10,L8=3,'2. Prix actuels'!$C$11,L8=4,'2. Prix actuels'!$C$12,L8<1,0)","v":3.5},0,{"$f":"_xlfn.IFS(N8=1,'2. Prix actuels'!$C$15,N8=2,'2. Prix actuels'!$C$16,N8=3,'2. Prix actuels'!$C$17,N8<1,0)","v":0},"O",{"$f":"IF(P8=\"o\",'2. Prix actuels'!$C$6,0)","v":55},"O",{"$f":"IF(R8=\"o\",IF('2. Prix actuels'!$C$21*F8/100<=6000,'2. Prix actuels'!$C$21*'4. Données de calcul'!F8/100,6000),0)","v":29},"N",{"$f":"IF(T8=\"o\",'2. Prix actuels'!$C$24,0)","v":0},"N",{"$f":"IF(V8=\"o\",'2. Prix actuels'!$C$25,0)","v":0},"N",{"$f":"IF(X8=\"o\",F8*'2. Prix actuels'!$C$27/100,0)","v":0},"O",{"$f":"IF(Z8=\"o\",F8*'2. Prix actuels'!$C$26/100,0)","v":2.9},1.25,0]
["Petit outillage manuel",6,1.23,"Débroussailleuse lourde",null,2050,{"$f":"IF(F9>0,F9*'2. Prix actuels'!$C$32/100,0)","v":102.5},{"$f":"IF(F9>0,'2. Prix actuels'!$C$30,0)","v":5},1200,4,0.6,{"$f":"IF('2. Prix actuels'!$B$11=\"Oui\",3,4)","v":4},{"$f":"_xlfn.IFS(L9=1,'2. Prix actuels'!$C$9,L9=2,'2. Prix actuels'!$C$10,L9=3,'2. Prix actuels'!$C$11,L9=4,'2. Prix actuels'!$C$12,L9<1,0)","v":3.5},0,{"$f":"_xlfn.IFS(N9=1,'2. Prix actuels'!$C$15,N9=2,'2. Prix actuels'!$C$16,N9=3,'2. Prix actuels'!$C$17,N9<1,0)","v":0},"O",{"$f":"IF(P9=\"o\",'2. Prix actuels'!$C$6,0)","v":55},"O",{"$f":"IF(R9=\"o\",IF('2. Prix actuels'!$C$21*F9/100<=6000,'2. Prix actuels'!$C$21*'4. Données de calcul'!F9/100,6000),0)","v":41},"N",{"$f":"IF(T9=\"o\",'2. Prix actuels'!$C$24,0)","v":0},"N",{"$f":"IF(V9=\"o\",'2. Prix actuels'!$C$25,0)","v":0},"N",{"$f":"IF(X9=\"o\",F9*'2. Prix actuels'!$C$27/100,0)","v":0},"O",{"$f":"IF(Z9=\"o\",F9*'2. Prix actuels'!$C$26/100,0)","v":4.0999999999999996},1.5,0]
["Petit outillage manuel",7,1.31,"Scie à moteur avec treuil moyenne",null,3800,{"$f":"IF(F10>0,F10*'2. Prix actuels'!$C$32/100,0)","v":190},{"$f":"IF(F10>0,'2. Prix actuels'!$C$30,0)","v":5},1200,5,1,{"$f":"IF('2. Prix actuels'!$B$11=\"Oui\",3,4)","v":4},{"$f":"_xlfn.IFS(L10=1,'2. Prix actuels'!$C$9,L10=2,'2. Prix actuels'!$C$10,L10=3,'2. Prix actuels'!$C$11,L10=4,'2. Prix actuels'!$C$12,L10<1,0)","v":3.5},0,{"$f":"_xlfn.IFS(N10=1,'2. Prix actuels'!$C$15,N10=2,'2. Prix actuels'!$C$16,N10=3,'2. Prix actuels'!$C$17,N10<1,0)","v":0},"O",{"$f":"IF(P10=\"o\",'2. Prix actuels'!$C$6,0)","v":55},"O",{"$f":"IF(R10=\"o\",IF('2. Prix actuels'!$C$21*F10/100<=6000,'2. Prix actuels'!$C$21*'4. Données de calcul'!F10/100,6000),0)","v":76},"N",{"$f":"IF(T10=\"o\",'2. Prix actuels'!$C$24,0)","v":0},"N",{"$f":"IF(V10=\"o\",'2. Prix actuels'!$C$25,0)","v":0},"N",{"$f":"IF(X10=\"o\",F10*'2. Prix actuels'!$C$27/100,0)","v":0},"O",{"$f":"IF(Z10=\"o\",F10*'2. Prix actuels'!$C$26/100,0)","v":7.6},1.5,0]
["Petit outillage manuel",8,1.41,"Tarière légère",null,900,{"$f":"IF(F11>0,F11*'2. Prix actuels'!$C$32/100,0)","v":45},{"$f":"IF(F11>0,'2. Prix actuels'!$C$30,0)","v":5},1200,6,0.6,{"$f":"IF('2. Prix actuels'!$B$11=\"Oui\",3,4)","v":4},{"$f":"_xlfn.IFS(L11=1,'2. Prix actuels'!$C$9,L11=2,'2. Prix actuels'!$C$10,L11=3,'2. Prix actuels'!$C$11,L11=4,'2. Prix actuels'!$C$12,L11<1,0)","v":3.5},0,{"$f":"_xlfn.IFS(N11=1,'2. Prix actuels'!$C$15,N11=2,'2. Prix actuels'!$C$16,N11=3,'2. Prix actuels'!$C$17,N11<1,0)","v":0},"O",{"$f":"IF(P11=\"o\",'2. Prix actuels'!$C$6,0)","v":55},"O",{"$f":"IF(R11=\"o\",IF('2. Prix actuels'!$C$21*F11/100<=6000,'2. Prix actuels'!$C$21*'4. Données de calcul'!F11/100,6000),0)","v":18},"N",{"$f":"IF(T11=\"o\",'2. Prix actuels'!$C$24,0)","v":0},"N",{"$f":"IF(V11=\"o\",'2. Prix actuels'!$C$25,0)","v":0},"N",{"$f":"IF(X11=\"o\",F11*'2. Prix actuels'!$C$27/100,0)","v":0},"O",{"$f":"IF(Z11=\"o\",F11*'2. Prix actuels'!$C$26/100,0)","v":1.8},1,0]
["Petit outillage manuel",9,1.42,"Tarière lourde",null,2600,{"$f":"IF(F12>0,F12*'2. Prix actuels'!$C$32/100,0)","v":130},{"$f":"IF(F12>0,'2. Prix actuels'!$C$30,0)","v":5},1200,6,0.8,{"$f":"IF('2. Prix actuels'!$B$11=\"Oui\",3,4)","v":4},{"$f":"_xlfn.IFS(L12=1,'2. Prix actuels'!$C$9,L12=2,'2. Prix actuels'!$C$10,L12=3,'2. Prix actuels'!$C$11,L12=4,'2. Prix actuels'!$C$12,L12<1,0)","v":3.5},0,{"$f":"_xlfn.IFS(N12=1,'2. Prix actuels'!$C$15,N12=2,'2. Prix actuels'!$C$16,N12=3,'2. Prix actuels'!$C$17,N12<1,0)","v":0},"O",{"$f":"IF(P12=\"o\",'2. Prix actuels'!$C$6,0)","v":55},"O",{"$f":"IF(R12=\"o\",IF('2. Prix actuels'!$C$21*F12/100<=6000,'2. Prix actuels'!$C$21*'4. Données de calcul'!F12/100,6000),0)","v":52},"N",{"$f":"IF(T12=\"o\",'2. Prix actuels'!$C$24,0)","v":0},"N",{"$f":"IF(V12=\"o\",'2. Prix actuels'!$C$25,0)","v":0},"N",{"$f":"IF(X12=\"o\",F12*'2. Prix actuels'!$C$27/100,0)","v":0},"O",{"$f":"IF(Z12=\"o\",F12*'2. Prix actuels'!$C$26/100,0)","v":5.2},1.5,0]
["Petit outillage manuel",10,1.51,"Ecorceuse \"Eder\" avec moteur de tronçonneuse",null,2000,{"$f":"IF(F13>0,F13*'2. Prix actuels'!$C$32/100,0)","v":100},{"$f":"IF(F13>0,'2. Prix actuels'!$C$30,0)","v":5},1200,5,0.9,{"$f":"IF('2. Prix actuels'!$B$11=\"Oui\",3,4)","v":4},{"$f":"_xlfn.IFS(L13=1,'2. Prix actuels'!$C$9,L13=2,'2. Prix actuels'!$C$10,L13=3,'2. Prix actuels'!$C$11,L13=4,'2. Prix actuels'!$C$12,L13<1,0)","v":3.5},0,{"$f":"_xlfn.IFS(N13=1,'2. Prix actuels'!$C$15,N13=2,'2. Prix actuels'!$C$16,N13=3,'2. Prix actuels'!$C$17,N13<1,0)","v":0},"O",{"$f":"IF(P13=\"o\",'2. Prix actuels'!$C$6,0)","v":55},"O",{"$f":"IF(R13=\"o\",IF('2. Prix actuels'!$C$21*F13/100<=6000,'2. Prix actuels'!$C$21*'4. Données de calcul'!F13/100,6000),0)","v":40},"N",{"$f":"IF(T13=\"o\",'2. Prix actuels'!$C$24,0)","v":0},"N",{"$f":"IF(V13=\"o\",'2. Prix actuels'!$C$25,0)","v":0},"N",{"$f":"IF(X13=\"o\",F13*'2. Prix actuels'!$C$27/100,0)","v":0},"O",{"$f":"IF(Z13=\"o\",F13*'2. Prix actuels'!$C$26/100,0)","v":4},1.5,0]
["Petit outillage manuel",11,1.52,"Ecorceuse \"Biber\" avec moteur de tronçonneuse",null,3200,{"$f":"IF(F14>0,F14*'2. Prix actuels'!$C$32/100,0)","v":160},{"$f":"IF(F14>0,'2. Prix actuels'!$C$30,0)","v":5},1200,5,0.9,{"$f":"IF('2. Prix actuels'!$B$11=\"Oui\",3,4)","v":4},{"$f":"_xlfn.IFS(L14=1,'2. Prix actuels'!$C$9,L14=2,'2. Prix actuels'!$C$10,L14=3,'2. Prix actuels'!$C$11,L14=4,'2. Prix actuels'!$C$12,L14<1,0)","v":3.5},0,{"$f":"_xlfn.IFS(N14=1,'2. Prix actuels'!$C$15,N14=2,'2. Prix actuels'!$C$16,N14=3,'2. Prix actuels'!$C$17,N14<1,0)","v":0},"O",{"$f":"IF(P14=\"o\",'2. Prix actuels'!$C$6,0)","v":55},"O",{"$f":"IF(R14=\"o\",IF('2. Prix actuels'!$C$21*F14/100<=6000,'2. Prix actuels'!$C$21*'4. Données de calcul'!F14/100,6000),0)","v":64},"N",{"$f":"IF(T14=\"o\",'2. Prix actuels'!$C$24,0)","v":0},"N",{"$f":"IF(V14=\"o\",'2. Prix actuels'!$C$25,0)","v":0},"N",{"$f":"IF(X14=\"o\",F14*'2. Prix actuels'!$C$27/100,0)","v":0},"O",{"$f":"IF(Z14=\"o\",F14*'2. Prix actuels'!$C$26/100,0)","v":6.4},1.5,0]
["Tracteur et équipement",12,2.11,"Transporteur forestier (sans 2.4/2.5) moyen",30,58000,{"$f":"IF(F15>0,F15*'2. Prix actuels'!$C$32/100,0)","v":2900},{"$f":"IF(F15>0,'2. Prix actuels'!$C$30,0)","v":5},7000,7,1.1000000000000001,1,{"$f":"_xlfn.IFS(L15=1,'2. Prix actuels'!$C$9,L15=2,'2. Prix actuels'!$C$10,L15=3,'2. Prix actuels'!$C$11,L15=4,'2. Prix actuels'!$C$12,L15<1,0)","v":1.65},1,{"$f":"_xlfn.IFS(N15=1,'2. Prix actuels'!$C$15,N15=2,'2. Prix actuels'!$C$16,N15=3,'2. Prix actuels'!$C$17,N15<1,0)","v":6.5},"O",{"$f":"IF(P15=\"o\",'2. Prix actuels'!$C$6,0)","v":55},"O",{"$f":"IF(R15=\"o\",IF('2. Prix actuels'!$C$21*F15/100<=6000,'2. Prix actuels'!$C$21*'4. Données de calcul'!F15/100,6000),0)","v":1160},"O",{"$f":"IF(T15=\"o\",'2. Prix actuels'!$C$24,0)","v":100},"O",{"$f":"IF(V15=\"o\",'2. Prix actuels'!$C$25,0)","v":290},"O",{"$f":"IF(X15=\"o\",F15*'2. Prix actuels'!$C$27/100,0)","v":1624},"N",{"$f":"IF(Z15=\"o\",F15*'2. Prix actuels'!$C$26/100,0)","v":0},3.6,0.12]
["Tracteur et équipement",13,2.12,"Transporteur forestier (sans 2.4/2.5) lourd",40,75000,{"$f":"IF(F16>0,F16*'2. Prix actuels'!$C$32/100,0)","v":3750},{"$f":"IF(F16>0,'2. Prix actuels'!$C$30,0)","v":5},7000,7,1.1000000000000001,1,{"$f":"_xlfn.IFS(L16=1,'2. Prix actuels'!$C$9,L16=2,'2. Prix actuels'!$C$10,L16=3,'2. Prix actuels'!$C$11,L16=4,'2. Prix actuels'!$C$12,L16<1,0)","v":1.65},1,{"$f":"_xlfn.IFS(N16=1,'2. Prix actuels'!$C$15,N16=2,'2. Prix actuels'!$C$16,N16=3,'2. Prix actuels'!$C$17,N16<1,0)","v":6.5},"O",{"$f":"IF(P16=\"o\",'2. Prix actuels'!$C$6,0)","v":55},"O",{"$f":"IF(R16=\"o\",IF('2. Prix actuels'!$C$21*F16/100<=6000,'2. Prix actuels'!$C$21*'4. Données de calcul'!F16/100,6000),0)","v":1500},"O",{"$f":"IF(T16=\"o\",'2. Prix actuels'!$C$24,0)","v":100},"O",{"$f":"IF(V16=\"o\",'2. Prix actuels'!$C$25,0)","v":290},"O",{"$f":"IF(X16=\"o\",F16*'2. Prix actuels'!$C$27/100,0)","v":2100},"N",{"$f":"IF(Z16=\"o\",F16*'2. Prix actuels'!$C$26/100,0)","v":0},4.8,0.16]
["Tracteur et équipement",14,2.21,"Tracteur forestier (sans 2.4/2.5) moyen",50,90000,{"$f":"IF(F17>0,F17*'2. Prix actuels'!$C$32/100,0)","v":4500},{"$f":"IF(F17>0,'2. Prix actuels'!$C$30,0)","v":5},10000,10,1,1,{"$f":"_xlfn.IFS(L17=1,'2. Prix actuels'!$C$9,L17=2,'2. Prix actuels'!$C$10,L17=3,'2. Prix actuels'!$C$11,L17=4,'2. Prix actuels'!$C$12,L17<1,0)","v":1.65},1,{"$f":"_xlfn.IFS(N17=1,'2. Prix actuels'!$C$15,N17=2,'2. Prix actuels'!$C$16,N17=3,'2. Prix actuels'!$C$17,N17<1,0)","v":6.5},"O",{"$f":"IF(P17=\"o\",'2. Prix actuels'!$C$6,0)","v":55},"O",{"$f":"IF(R17=\"o\",IF('2. Prix actuels'!$C$21*F17/100<=6000,'2. Prix actuels'!$C$21*'4. Données de calcul'!F17/100,6000),0)","v":1800},"O",{"$f":"IF(T17=\"o\",'2. Prix actuels'!$C$24,0)","v":100},"O",{"$f":"IF(V17=\"o\",'2. Prix actuels'!$C$25,0)","v":290},"O",{"$f":"IF(X17=\"o\",F17*'2. Prix actuels'!$C$27/100,0)","v":2519.9999999999995},"N",{"$f":"IF(Z17=\"o\",F17*'2. Prix actuels'!$C$26/100,0)","v":0},6,0.2]
["Tracteur et équipement",15,2.2200000000000002,"Tracteur forestier (sans 2.4/2.5) lourd",60,104000,{"$f":"IF(F18>0,F18*'2. Prix actuels'!$C$32/100,0)","v":5200},{"$f":"IF(F18>0,'2. Prix actuels'!$C$30,0)","v":5},10000,10,1,1,{"$f":"_xlfn.IFS(L18=1,'2. Prix actuels'!$C$9,L18=2,'2. Prix actuels'!$C$10,L18=3,'2. Prix actuels'!$C$11,L18=4,'2. Prix actuels'!$C$12,L18<1,0)","v":1.65},1,{"$f":"_xlfn.IFS(N18=1,'2. Prix actuels'!$C$15,N18=2,'2. Prix actuels'!$C$16,N18=3,'2. Prix actuels'!$C$17,N18<1,0)","v":6.5},"O",{"$f":"IF(P18=\"o\",'2. Prix actuels'!$C$6,0)","v":55},"O",{"$f":"IF(R18=\"o\",IF('2. Prix actuels'!$C$21*F18/100<=6000,'2. Prix actuels'!$C$21*'4. Données de calcul'!F18/100,6000),0)","v":2080},"O",{"$f":"IF(T18=\"o\",'2. Prix actuels'!$C$24,0)","v":100},"O",{"$f":"IF(V18=\"o\",'2. Prix actuels'!$C$25,0)","v":290},"O",{"$f":"IF(X18=\"o\",F18*'2. Prix actuels'!$C$27/100,0)","v":2912},"N",{"$f":"IF(Z18=\"o\",F18*'2. Prix actuels'!$C$26/100,0)","v":0},7.2,0.24]
["Tracteur et équipement",16,2.31,"Tracteur de débardage (sans 2.4/2.5) léger",45,110000,{"$f":"IF(F19>0,F19*'2. Prix actuels'!$C$32/100,0)","v":5500},{"$f":"IF(F19>0,'2. Prix actuels'!$C$30,0)","v":5},10000,10,0.9,1,{"$f":"_xlfn.IFS(L19=1,'2. Prix actuels'!$C$9,L19=2,'2. Prix actuels'!$C$10,L19=3,'2. Prix actuels'!$C$11,L19=4,'2. Prix actuels'!$C$12,L19<1,0)","v":1.65},1,{"$f":"_xlfn.IFS(N19=1,'2. Prix actuels'!$C$15,N19=2,'2. Prix actuels'!$C$16,N19=3,'2. Prix actuels'!$C$17,N19<1,0)","v":6.5},"O",{"$f":"IF(P19=\"o\",'2. Prix actuels'!$C$6,0)","v":55},"O",{"$f":"IF(R19=\"o\",IF('2. Prix actuels'!$C$21*F19/100<=6000,'2. Prix actuels'!$C$21*'4. Données de calcul'!F19/100,6000),0)","v":2200},"O",{"$f":"IF(T19=\"o\",'2. Prix actuels'!$C$24,0)","v":100},"O",{"$f":"IF(V19=\"o\",'2. Prix actuels'!$C$25,0)","v":290},"O",{"$f":"IF(X19=\"o\",F19*'2. Prix actuels'!$C$27/100,0)","v":3080},"N",{"$f":"IF(Z19=\"o\",F19*'2. Prix actuels'!$C$26/100,0)","v":0},5.4,0.18]
["Tracteur et équipement",17,2.3199999999999998,"Tracteur de débardage (sans 2.4/2.5) moyen",60,150000,{"$f":"IF(F20>0,F20*'2. Prix actuels'!$C$32/100,0)","v":7500},{"$f":"IF(F20>0,'2. Prix actuels'!$C$30,0)","v":5},10000,10,0.9,1,{"$f":"_xlfn.IFS(L20=1,'2. Prix actuels'!$C$9,L20=2,'2. Prix actuels'!$C$10,L20=3,'2. Prix actuels'!$C$11,L20=4,'2. Prix actuels'!$C$12,L20<1,0)","v":1.65},1,{"$f":"_xlfn.IFS(N20=1,'2. Prix actuels'!$C$15,N20=2,'2. Prix actuels'!$C$16,N20=3,'2. Prix actuels'!$C$17,N20<1,0)","v":6.5},"O",{"$f":"IF(P20=\"o\",'2. Prix actuels'!$C$6,0)","v":55},"O",{"$f":"IF(R20=\"o\",IF('2. Prix actuels'!$C$21*F20/100<=6000,'2. Prix actuels'!$C$21*'4. Données de calcul'!F20/100,6000),0)","v":3000},"O",{"$f":"IF(T20=\"o\",'2. Prix actuels'!$C$24,0)","v":100},"O",{"$f":"IF(V20=\"o\",'2. Prix actuels'!$C$25,0)","v":290},"O",{"$f":"IF(X20=\"o\",F20*'2. Prix actuels'!$C$27/100,0)","v":4200},"N",{"$f":"IF(Z20=\"o\",F20*'2. Prix actuels'!$C$26/100,0)","v":0},7.2,0.24]
["Tracteur et équipement",18,2.33,"Tracteur de débardage (sans 2.4/2.5) lourd",75,200000,{"$f":"IF(F21>0,F21*'2. Prix actuels'!$C$32/100,0)","v":10000},{"$f":"IF(F21>0,'2. Prix actuels'!$C$30,0)","v":5},10000,10,0.9,1,{"$f":"_xlfn.IFS(L21=1,'2. Prix actuels'!$C$9,L21=2,'2. Prix actuels'!$C$10,L21=3,'2. Prix actuels'!$C$11,L21=4,'2. Prix actuels'!$C$12,L21<1,0)","v":1.65},1,{"$f":"_xlfn.IFS(N21=1,'2. Prix actuels'!$C$15,N21=2,'2. Prix actuels'!$C$16,N21=3,'2. Prix actuels'!$C$17,N21<1,0)","v":6.5},"O",{"$f":"IF(P21=\"o\",'2. Prix actuels'!$C$6,0)","v":55},"O",{"$f":"IF(R21=\"o\",IF('2. Prix actuels'!$C$21*F21/100<=6000,'2. Prix actuels'!$C$21*'4. Données de calcul'!F21/100,6000),0)","v":4000},"O",{"$f":"IF(T21=\"o\",'2. Prix actuels'!$C$24,0)","v":100},"O",{"$f":"IF(V21=\"o\",'2. Prix actuels'!$C$25,0)","v":290},"O",{"$f":"IF(X21=\"o\",F21*'2. Prix actuels'!$C$27/100,0)","v":5600},"N",{"$f":"IF(Z21=\"o\",F21*'2. Prix actuels'!$C$26/100,0)","v":0},9,0.3]
["Tracteur et équipement",19,2.41,"Treuil pour tracteur, un tambour 6 t",null,23000,{"$f":"IF(F22>0,F22*'2. Prix actuels'!$C$32/100,0)","v":1150},{"$f":"IF(F22>0,'2. Prix actuels'!$C$30,0)","v":5},10000,10,0.8,null,{"$f":"_xlfn.IFS(L22=1,'2. Prix actuels'!$C$9,L22=2,'2. Prix actuels'!$C$10,L22=3,'2. Prix actuels'!$C$11,L22=4,'2. Prix actuels'!$C$12,L22<1,0)","v":0},null,{"$f":"_xlfn.IFS(N22=1,'2. Prix actuels'!$C$15,N22=2,'2. Prix actuels'!$C$16,N22=3,'2. Prix actuels'!$C$17,N22<1,0)","v":0},"O",{"$f":"IF(P22=\"o\",'2. Prix actuels'!$C$6,0)","v":55},"O",{"$f":"IF(R22=\"o\",IF('2. Prix actuels'!$C$21*F22/100<=6000,'2. Prix actuels'!$C$21*'4. Données de calcul'!F22/100,6000),0)","v":460},"N",{"$f":"IF(T22=\"o\",'2. Prix actuels'!$C$24,0)","v":0},"N",{"$f":"IF(V22=\"o\",'2. Prix actuels'!$C$25,0)","v":0},"O",{"$f":"IF(X22=\"o\",F22*'2. Prix actuels'!$C$27/100,0)","v":643.99999999999989},"N",{"$f":"IF(Z22=\"o\",F22*'2. Prix actuels'!$C$26/100,0)","v":0},0,0]
["Tracteur et équipement",20,2.42,"Treuil pour tracteur, double tambour 6 t",null,44000,{"$f":"IF(F23>0,F23*'2. Prix actuels'!$C$32/100,0)","v":2200},{"$f":"IF(F23>0,'2. Prix actuels'!$C$30,0)","v":5},10000,10,0.8,null,{"$f":"_xlfn.IFS(L23=1,'2. Prix actuels'!$C$9,L23=2,'2. Prix actuels'!$C$10,L23=3,'2. Prix actuels'!$C$11,L23=4,'2. Prix actuels'!$C$12,L23<1,0)","v":0},null,{"$f":"_xlfn.IFS(N23=1,'2. Prix actuels'!$C$15,N23=2,'2. Prix actuels'!$C$16,N23=3,'2. Prix actuels'!$C$17,N23<1,0)","v":0},"O",{"$f":"IF(P23=\"o\",'2. Prix actuels'!$C$6,0)","v":55},"O",{"$f":"IF(R23=\"o\",IF('2. Prix actuels'!$C$21*F23/100<=6000,'2. Prix actuels'!$C$21*'4. Données de calcul'!F23/100,6000),0)","v":880},"N",{"$f":"IF(T23=\"o\",'2. Prix actuels'!$C$24,0)","v":0},"N",{"$f":"IF(V23=\"o\",'2. Prix actuels'!$C$25,0)","v":0},"O",{"$f":"IF(X23=\"o\",F23*'2. Prix actuels'!$C$27/100,0)","v":1231.9999999999998},"N",{"$f":"IF(Z23=\"o\",F23*'2. Prix actuels'!$C$26/100,0)","v":0},0,0]
["Tracteur et équipement",21,2.4300000000000002,"Treuil pour tracteur, un tambour 8 t",null,29000,{"$f":"IF(F24>0,F24*'2. Prix actuels'!$C$32/100,0)","v":1450},{"$f":"IF(F24>0,'2. Prix actuels'!$C$30,0)","v":5},10000,10,0.8,null,{"$f":"_xlfn.IFS(L24=1,'2. Prix actuels'!$C$9,L24=2,'2. Prix actuels'!$C$10,L24=3,'2. Prix actuels'!$C$11,L24=4,'2. Prix actuels'!$C$12,L24<1,0)","v":0},null,{"$f":"_xlfn.IFS(N24=1,'2. Prix actuels'!$C$15,N24=2,'2. Prix actuels'!$C$16,N24=3,'2. Prix actuels'!$C$17,N24<1,0)","v":0},"O",{"$f":"IF(P24=\"o\",'2. Prix actuels'!$C$6,0)","v":55},"O",{"$f":"IF(R24=\"o\",IF('2. Prix actuels'!$C$21*F24/100<=6000,'2. Prix actuels'!$C$21*'4. Données de calcul'!F24/100,6000),0)","v":580},"N",{"$f":"IF(T24=\"o\",'2. Prix actuels'!$C$24,0)","v":0},"N",{"$f":"IF(V24=\"o\",'2. Prix actuels'!$C$25,0)","v":0},"O",{"$f":"IF(X24=\"o\",F24*'2. Prix actuels'!$C$27/100,0)","v":812},"N",{"$f":"IF(Z24=\"o\",F24*'2. Prix actuels'!$C$26/100,0)","v":0},0,0]
["Tracteur et équipement",22,2.44,"Treuil pour tracteur, double tambour 8 t",null,49000,{"$f":"IF(F25>0,F25*'2. Prix actuels'!$C$32/100,0)","v":2450},{"$f":"IF(F25>0,'2. Prix actuels'!$C$30,0)","v":5},10000,10,0.8,null,{"$f":"_xlfn.IFS(L25=1,'2. Prix actuels'!$C$9,L25=2,'2. Prix actuels'!$C$10,L25=3,'2. Prix actuels'!$C$11,L25=4,'2. Prix actuels'!$C$12,L25<1,0)","v":0},null,{"$f":"_xlfn.IFS(N25=1,'2. Prix actuels'!$C$15,N25=2,'2. Prix actuels'!$C$16,N25=3,'2. Prix actuels'!$C$17,N25<1,0)","v":0},"O",{"$f":"IF(P25=\"o\",'2. Prix actuels'!$C$6,0)","v":55},"O",{"$f":"IF(R25=\"o\",IF('2. Prix actuels'!$C$21*F25/100<=6000,'2. Prix actuels'!$C$21*'4. Données de calcul'!F25/100,6000),0)","v":980},"N",{"$f":"IF(T25=\"o\",'2. Prix actuels'!$C$24,0)","v":0},"N",{"$f":"IF(V25=\"o\",'2. Prix actuels'!$C$25,0)","v":0},"O",{"$f":"IF(X25=\"o\",F25*'2. Prix actuels'!$C$27/100,0)","v":1372},"N",{"$f":"IF(Z25=\"o\",F25*'2. Prix actuels'!$C$26/100,0)","v":0},0,0]
["Tracteur et équipement",23,2.4500000000000002,"Treuil pour tracteur, bouclier frontal",null,26000,{"$f":"IF(F26>0,F26*'2. Prix actuels'!$C$32/100,0)","v":1300},{"$f":"IF(F26>0,'2. Prix actuels'!$C$30,0)","v":5},10000,10,0.5,null,{"$f":"_xlfn.IFS(L26=1,'2. Prix actuels'!$C$9,L26=2,'2. Prix actuels'!$C$10,L26=3,'2. Prix actuels'!$C$11,L26=4,'2. Prix actuels'!$C$12,L26<1,0)","v":0},null,{"$f":"_xlfn.IFS(N26=1,'2. Prix actuels'!$C$15,N26=2,'2. Prix actuels'!$C$16,N26=3,'2. Prix actuels'!$C$17,N26<1,0)","v":0},"O",{"$f":"IF(P26=\"o\",'2. Prix actuels'!$C$6,0)","v":55},"O",{"$f":"IF(R26=\"o\",IF('2. Prix actuels'!$C$21*F26/100<=6000,'2. Prix actuels'!$C$21*'4. Données de calcul'!F26/100,6000),0)","v":520},"N",{"$f":"IF(T26=\"o\",'2. Prix actuels'!$C$24,0)","v":0},"N",{"$f":"IF(V26=\"o\",'2. Prix actuels'!$C$25,0)","v":0},"O",{"$f":"IF(X26=\"o\",F26*'2. Prix actuels'!$C$27/100,0)","v":728},"N",{"$f":"IF(Z26=\"o\",F26*'2. Prix actuels'!$C$26/100,0)","v":0},0,0]
["Tracteur et équipement",24,2.5099999999999998,"Commande radio pour treuil à un tambour",null,10000,{"$f":"IF(F27>0,F27*'2. Prix actuels'!$C$32/100,0)","v":500},{"$f":"IF(F27>0,'2. Prix actuels'!$C$30,0)","v":5},10000,10,0.7,null,{"$f":"_xlfn.IFS(L27=1,'2. Prix actuels'!$C$9,L27=2,'2. Prix actuels'!$C$10,L27=3,'2. Prix actuels'!$C$11,L27=4,'2. Prix actuels'!$C$12,L27<1,0)","v":0},null,{"$f":"_xlfn.IFS(N27=1,'2. Prix actuels'!$C$15,N27=2,'2. Prix actuels'!$C$16,N27=3,'2. Prix actuels'!$C$17,N27<1,0)","v":0},"O",{"$f":"IF(P27=\"o\",'2. Prix actuels'!$C$6,0)","v":55},"O",{"$f":"IF(R27=\"o\",IF('2. Prix actuels'!$C$21*F27/100<=6000,'2. Prix actuels'!$C$21*'4. Données de calcul'!F27/100,6000),0)","v":200},"N",{"$f":"IF(T27=\"o\",'2. Prix actuels'!$C$24,0)","v":0},"N",{"$f":"IF(V27=\"o\",'2. Prix actuels'!$C$25,0)","v":0},"O",{"$f":"IF(X27=\"o\",F27*'2. Prix actuels'!$C$27/100,0)","v":280},"N",{"$f":"IF(Z27=\"o\",F27*'2. Prix actuels'!$C$26/100,0)","v":0},0,0]
["Tracteur et équipement",25,2.52,"Commande radio pour treuil à double tambour",null,13000,{"$f":"IF(F28>0,F28*'2. Prix actuels'!$C$32/100,0)","v":650},{"$f":"IF(F28>0,'2. Prix actuels'!$C$30,0)","v":5},10000,10,0.7,null,{"$f":"_xlfn.IFS(L28=1,'2. Prix actuels'!$C$9,L28=2,'2. Prix actuels'!$C$10,L28=3,'2. Prix actuels'!$C$11,L28=4,'2. Prix actuels'!$C$12,L28<1,0)","v":0},null,{"$f":"_xlfn.IFS(N28=1,'2. Prix actuels'!$C$15,N28=2,'2. Prix actuels'!$C$16,N28=3,'2. Prix actuels'!$C$17,N28<1,0)","v":0},"O",{"$f":"IF(P28=\"o\",'2. Prix actuels'!$C$6,0)","v":55},"O",{"$f":"IF(R28=\"o\",IF('2. Prix actuels'!$C$21*F28/100<=6000,'2. Prix actuels'!$C$21*'4. Données de calcul'!F28/100,6000),0)","v":260},"N",{"$f":"IF(T28=\"o\",'2. Prix actuels'!$C$24,0)","v":0},"N",{"$f":"IF(V28=\"o\",'2. Prix actuels'!$C$25,0)","v":0},"O",{"$f":"IF(X28=\"o\",F28*'2. Prix actuels'!$C$27/100,0)","v":364},"N",{"$f":"IF(Z28=\"o\",F28*'2. Prix actuels'!$C$26/100,0)","v":0},0,0]
["Tracteurs agricoles",26,3.11,"Tracteur agricole sans 4x4, léger",33,42000,{"$f":"IF(F29>0,F29*'2. Prix actuels'!$C$32/100,0)","v":2100},{"$f":"IF(F29>0,'2. Prix actuels'!$C$30,0)","v":5},7000,7,1.1000000000000001,1,{"$f":"_xlfn.IFS(L29=1,'2. Prix actuels'!$C$9,L29=2,'2. Prix actuels'!$C$10,L29=3,'2. Prix actuels'!$C$11,L29=4,'2. Prix actuels'!$C$12,L29<1,0)","v":1.65},1,{"$f":"_xlfn.IFS(N29=1,'2. Prix actuels'!$C$15,N29=2,'2. Prix actuels'!$C$16,N29=3,'2. Prix actuels'!$C$17,N29<1,0)","v":6.5},"O",{"$f":"IF(P29=\"o\",'2. Prix actuels'!$C$6,0)","v":55},"O",{"$f":"IF(R29=\"o\",IF('2. Prix actuels'!$C$21*F29/100<=6000,'2. Prix actuels'!$C$21*'4. Données de calcul'!F29/100,6000),0)","v":840},"O",{"$f":"IF(T29=\"o\",'2. Prix actuels'!$C$24,0)","v":100},"O",{"$f":"IF(V29=\"o\",'2. Prix actuels'!$C$25,0)","v":290},"O",{"$f":"IF(X29=\"o\",F29*'2. Prix actuels'!$C$27/100,0)","v":1175.9999999999998},"N",{"$f":"IF(Z29=\"o\",F29*'2. Prix actuels'!$C$26/100,0)","v":0},4,0.13200000000000001]
["Tracteurs agricoles",27,3.12,"Tracteur agricole sans 4x4, moyen",50,58000,{"$f":"IF(F30>0,F30*'2. Prix actuels'!$C$32/100,0)","v":2900},{"$f":"IF(F30>0,'2. Prix actuels'!$C$30,0)","v":5},7000,7,1.1000000000000001,1,{"$f":"_xlfn.IFS(L30=1,'2. Prix actuels'!$C$9,L30=2,'2. Prix actuels'!$C$10,L30=3,'2. Prix actuels'!$C$11,L30=4,'2. Prix actuels'!$C$12,L30<1,0)","v":1.65},1,{"$f":"_xlfn.IFS(N30=1,'2. Prix actuels'!$C$15,N30=2,'2. Prix actuels'!$C$16,N30=3,'2. Prix actuels'!$C$17,N30<1,0)","v":6.5},"O",{"$f":"IF(P30=\"o\",'2. Prix actuels'!$C$6,0)","v":55},"O",{"$f":"IF(R30=\"o\",IF('2. Prix actuels'!$C$21*F30/100<=6000,'2. Prix actuels'!$C$21*'4. Données de calcul'!F30/100,6000),0)","v":1160},"O",{"$f":"IF(T30=\"o\",'2. Prix actuels'!$C$24,0)","v":100},"O",{"$f":"IF(V30=\"o\",'2. Prix actuels'!$C$25,0)","v":290},"O",{"$f":"IF(X30=\"o\",F30*'2. Prix actuels'!$C$27/100,0)","v":1624},"N",{"$f":"IF(Z30=\"o\",F30*'2. Prix actuels'!$C$26/100,0)","v":0},6,0.2]
["Tracteurs agricoles",28,3.13,"Tracteur agricole sans 4x4, lourd",70,87000,{"$f":"IF(F31>0,F31*'2. Prix actuels'!$C$32/100,0)","v":4350},{"$f":"IF(F31>0,'2. Prix actuels'!$C$30,0)","v":5},10000,10,1.1000000000000001,1,{"$f":"_xlfn.IFS(L31=1,'2. Prix actuels'!$C$9,L31=2,'2. Prix actuels'!$C$10,L31=3,'2. Prix actuels'!$C$11,L31=4,'2. Prix actuels'!$C$12,L31<1,0)","v":1.65},1,{"$f":"_xlfn.IFS(N31=1,'2. Prix actuels'!$C$15,N31=2,'2. Prix actuels'!$C$16,N31=3,'2. Prix actuels'!$C$17,N31<1,0)","v":6.5},"O",{"$f":"IF(P31=\"o\",'2. Prix actuels'!$C$6,0)","v":55},"O",{"$f":"IF(R31=\"o\",IF('2. Prix actuels'!$C$21*F31/100<=6000,'2. Prix actuels'!$C$21*'4. Données de calcul'!F31/100,6000),0)","v":1740},"O",{"$f":"IF(T31=\"o\",'2. Prix actuels'!$C$24,0)","v":100},"O",{"$f":"IF(V31=\"o\",'2. Prix actuels'!$C$25,0)","v":290},"O",{"$f":"IF(X31=\"o\",F31*'2. Prix actuels'!$C$27/100,0)","v":2435.9999999999995},"N",{"$f":"IF(Z31=\"o\",F31*'2. Prix actuels'!$C$26/100,0)","v":0},8.4,0.28000000000000003]
["Tracteurs agricoles",29,3.21,"Tracteur agricole avec 4x4, moyen",60,73500,{"$f":"IF(F32>0,F32*'2. Prix actuels'!$C$32/100,0)","v":3675},{"$f":"IF(F32>0,'2. Prix actuels'!$C$30,0)","v":5},10000,10,1.1000000000000001,1,{"$f":"_xlfn.IFS(L32=1,'2. Prix actuels'!$C$9,L32=2,'2. Prix actuels'!$C$10,L32=3,'2. Prix actuels'!$C$11,L32=4,'2. Prix actuels'!$C$12,L32<1,0)","v":1.65},1,{"$f":"_xlfn.IFS(N32=1,'2. Prix actuels'!$C$15,N32=2,'2. Prix actuels'!$C$16,N32=3,'2. Prix actuels'!$C$17,N32<1,0)","v":6.5},"O",{"$f":"IF(P32=\"o\",'2. Prix actuels'!$C$6,0)","v":55},"O",{"$f":"IF(R32=\"o\",IF('2. Prix actuels'!$C$21*F32/100<=6000,'2. Prix actuels'!$C$21*'4. Données de calcul'!F32/100,6000),0)","v":1470},"O",{"$f":"IF(T32=\"o\",'2. Prix actuels'!$C$24,0)","v":100},"O",{"$f":"IF(V32=\"o\",'2. Prix actuels'!$C$25,0)","v":290},"O",{"$f":"IF(X32=\"o\",F32*'2. Prix actuels'!$C$27/100,0)","v":2058},"N",{"$f":"IF(Z32=\"o\",F32*'2. Prix actuels'!$C$26/100,0)","v":0},7.2,0.2]
["Tracteurs agricoles",30,3.22,"Tracteur agricole avec 4x4, lourd",85,111000,{"$f":"IF(F33>0,F33*'2. Prix actuels'!$C$32/100,0)","v":5550},{"$f":"IF(F33>0,'2. Prix actuels'!$C$30,0)","v":5},10000,10,1.1000000000000001,1,{"$f":"_xlfn.IFS(L33=1,'2. Prix actuels'!$C$9,L33=2,'2. Prix actuels'!$C$10,L33=3,'2. Prix actuels'!$C$11,L33=4,'2. Prix actuels'!$C$12,L33<1,0)","v":1.65},1,{"$f":"_xlfn.IFS(N33=1,'2. Prix actuels'!$C$15,N33=2,'2. Prix actuels'!$C$16,N33=3,'2. Prix actuels'!$C$17,N33<1,0)","v":6.5},"O",{"$f":"IF(P33=\"o\",'2. Prix actuels'!$C$6,0)","v":55},"O",{"$f":"IF(R33=\"o\",IF('2. Prix actuels'!$C$21*F33/100<=6000,'2. Prix actuels'!$C$21*'4. Données de calcul'!F33/100,6000),0)","v":2220},"O",{"$f":"IF(T33=\"o\",'2. Prix actuels'!$C$24,0)","v":100},"O",{"$f":"IF(V33=\"o\",'2. Prix actuels'!$C$25,0)","v":290},"O",{"$f":"IF(X33=\"o\",F33*'2. Prix actuels'!$C$27/100,0)","v":3108},"N",{"$f":"IF(Z33=\"o\",F33*'2. Prix actuels'!$C$26/100,0)","v":0},10.199999999999999,0.34]
["Engins pour trois points",31,4.1100000000000003,"Treuil, un tambour 4 t",null,9000,{"$f":"IF(F34>0,F34*'2. Prix actuels'!$C$32/100,0)","v":450},{"$f":"IF(F34>0,'2. Prix actuels'!$C$30,0)","v":5},3000,7,1,null,{"$f":"_xlfn.IFS(L34=1,'2. Prix actuels'!$C$9,L34=2,'2. Prix actuels'!$C$10,L34=3,'2. Prix actuels'!$C$11,L34=4,'2. Prix actuels'!$C$12,L34<1,0)","v":0},null,{"$f":"_xlfn.IFS(N34=1,'2. Prix actuels'!$C$15,N34=2,'2. Prix actuels'!$C$16,N34=3,'2. Prix actuels'!$C$17,N34<1,0)","v":0},"O",{"$f":"IF(P34=\"o\",'2. Prix actuels'!$C$6,0)","v":55},"O",{"$f":"IF(R34=\"o\",IF('2. Prix actuels'!$C$21*F34/100<=6000,'2. Prix actuels'!$C$21*'4. Données de calcul'!F34/100,6000),0)","v":180},"N",{"$f":"IF(T34=\"o\",'2. Prix actuels'!$C$24,0)","v":0},"N",{"$f":"IF(V34=\"o\",'2. Prix actuels'!$C$25,0)","v":0},"N",{"$f":"IF(X34=\"o\",F34*'2. Prix actuels'!$C$27/100,0)","v":0},"O",{"$f":"IF(Z34=\"o\",F34*'2. Prix actuels'!$C$26/100,0)","v":18},0,0]
["Engins pour trois points",32,4.12,"Treuil, double tambour 6 t",null,16000,{"$f":"IF(F35>0,F35*'2. Prix actuels'!$C$32/100,0)","v":800},{"$f":"IF(F35>0,'2. Prix actuels'!$C$30,0)","v":5},3000,7,1,null,{"$f":"_xlfn.IFS(L35=1,'2. Prix actuels'!$C$9,L35=2,'2. Prix actuels'!$C$10,L35=3,'2. Prix actuels'!$C$11,L35=4,'2. Prix actuels'!$C$12,L35<1,0)","v":0},null,{"$f":"_xlfn.IFS(N35=1,'2. Prix actuels'!$C$15,N35=2,'2. Prix actuels'!$C$16,N35=3,'2. Prix actuels'!$C$17,N35<1,0)","v":0},"O",{"$f":"IF(P35=\"o\",'2. Prix actuels'!$C$6,0)","v":55},"O",{"$f":"IF(R35=\"o\",IF('2. Prix actuels'!$C$21*F35/100<=6000,'2. Prix actuels'!$C$21*'4. Données de calcul'!F35/100,6000),0)","v":320},"N",{"$f":"IF(T35=\"o\",'2. Prix actuels'!$C$24,0)","v":0},"N",{"$f":"IF(V35=\"o\",'2. Prix actuels'!$C$25,0)","v":0},"N",{"$f":"IF(X35=\"o\",F35*'2. Prix actuels'!$C$27/100,0)","v":0},"O",{"$f":"IF(Z35=\"o\",F35*'2. Prix actuels'!$C$26/100,0)","v":32},0,0]
["Engins pour trois points",33,4.21,"Fendeuse petite",null,5300,{"$f":"IF(F36>0,F36*'2. Prix actuels'!$C$32/100,0)","v":265},{"$f":"IF(F36>0,'2. Prix actuels'!$C$30,0)","v":5},3000,7,1,null,{"$f":"_xlfn.IFS(L36=1,'2. Prix actuels'!$C$9,L36=2,'2. Prix actuels'!$C$10,L36=3,'2. Prix actuels'!$C$11,L36=4,'2. Prix actuels'!$C$12,L36<1,0)","v":0},null,{"$f":"_xlfn.IFS(N36=1,'2. Prix actuels'!$C$15,N36=2,'2. Prix actuels'!$C$16,N36=3,'2. Prix actuels'!$C$17,N36<1,0)","v":0},"O",{"$f":"IF(P36=\"o\",'2. Prix actuels'!$C$6,0)","v":55},"O",{"$f":"IF(R36=\"o\",IF('2. Prix actuels'!$C$21*F36/100<=6000,'2. Prix actuels'!$C$21*'4. Données de calcul'!F36/100,6000),0)","v":106},"N",{"$f":"IF(T36=\"o\",'2. Prix actuels'!$C$24,0)","v":0},"N",{"$f":"IF(V36=\"o\",'2. Prix actuels'!$C$25,0)","v":0},"N",{"$f":"IF(X36=\"o\",F36*'2. Prix actuels'!$C$27/100,0)","v":0},"O",{"$f":"IF(Z36=\"o\",F36*'2. Prix actuels'!$C$26/100,0)","v":10.6},0,0]
["Engins pour trois points",34,4.22,"Fendeuse grosse",null,7700,{"$f":"IF(F37>0,F37*'2. Prix actuels'!$C$32/100,0)","v":385},{"$f":"IF(F37>0,'2. Prix actuels'!$C$30,0)","v":5},3000,7,1,null,{"$f":"_xlfn.IFS(L37=1,'2. Prix actuels'!$C$9,L37=2,'2. Prix actuels'!$C$10,L37=3,'2. Prix actuels'!$C$11,L37=4,'2. Prix actuels'!$C$12,L37<1,0)","v":0},null,{"$f":"_xlfn.IFS(N37=1,'2. Prix actuels'!$C$15,N37=2,'2. Prix actuels'!$C$16,N37=3,'2. Prix actuels'!$C$17,N37<1,0)","v":0},"O",{"$f":"IF(P37=\"o\",'2. Prix actuels'!$C$6,0)","v":55},"O",{"$f":"IF(R37=\"o\",IF('2. Prix actuels'!$C$21*F37/100<=6000,'2. Prix actuels'!$C$21*'4. Données de calcul'!F37/100,6000),0)","v":154},"N",{"$f":"IF(T37=\"o\",'2. Prix actuels'!$C$24,0)","v":0},"N",{"$f":"IF(V37=\"o\",'2. Prix actuels'!$C$25,0)","v":0},"N",{"$f":"IF(X37=\"o\",F37*'2. Prix actuels'!$C$27/100,0)","v":0},"O",{"$f":"IF(Z37=\"o\",F37*'2. Prix actuels'!$C$26/100,0)","v":15.4},0,0]
["Engins pour trois points",35,4.3099999999999996,"Grue",null,24500,{"$f":"IF(F38>0,F38*'2. Prix actuels'!$C$32/100,0)","v":1225},{"$f":"IF(F38>0,'2. Prix actuels'!$C$30,0)","v":5},3000,7,0.8,null,{"$f":"_xlfn.IFS(L38=1,'2. Prix actuels'!$C$9,L38=2,'2. Prix actuels'!$C$10,L38=3,'2. Prix actuels'!$C$11,L38=4,'2. Prix actuels'!$C$12,L38<1,0)","v":0},1,{"$f":"_xlfn.IFS(N38=1,'2. Prix actuels'!$C$15,N38=2,'2. Prix actuels'!$C$16,N38=3,'2. Prix actuels'!$C$17,N38<1,0)","v":6.5},"O",{"$f":"IF(P38=\"o\",'2. Prix actuels'!$C$6,0)","v":55},"O",{"$f":"IF(R38=\"o\",IF('2. Prix actuels'!$C$21*F38/100<=6000,'2. Prix actuels'!$C$21*'4. Données de calcul'!F38/100,6000),0)","v":490},"N",{"$f":"IF(T38=\"o\",'2. Prix actuels'!$C$24,0)","v":0},"N",{"$f":"IF(V38=\"o\",'2. Prix actuels'!$C$25,0)","v":0},"N",{"$f":"IF(X38=\"o\",F38*'2. Prix actuels'!$C$27/100,0)","v":0},"O",{"$f":"IF(Z38=\"o\",F38*'2. Prix actuels'!$C$26/100,0)","v":49},0,0.2]
["Engins pour trois points",36,4.32,"Accessoire pour feuillus",null,7500,{"$f":"IF(F39>0,F39*'2. Prix actuels'!$C$32/100,0)","v":375},{"$f":"IF(F39>0,'2. Prix actuels'!$C$30,0)","v":5},2000,7,0.8,null,{"$f":"_xlfn.IFS(L39=1,'2. Prix actuels'!$C$9,L39=2,'2. Prix actuels'!$C$10,L39=3,'2. Prix actuels'!$C$11,L39=4,'2. Prix actuels'!$C$12,L39<1,0)","v":0},null,{"$f":"_xlfn.IFS(N39=1,'2. Prix actuels'!$C$15,N39=2,'2. Prix actuels'!$C$16,N39=3,'2. Prix actuels'!$C$17,N39<1,0)","v":0},"O",{"$f":"IF(P39=\"o\",'2. Prix actuels'!$C$6,0)","v":55},"O",{"$f":"IF(R39=\"o\",IF('2. Prix actuels'!$C$21*F39/100<=6000,'2. Prix actuels'!$C$21*'4. Données de calcul'!F39/100,6000),0)","v":150},"N",{"$f":"IF(T39=\"o\",'2. Prix actuels'!$C$24,0)","v":0},"N",{"$f":"IF(V39=\"o\",'2. Prix actuels'!$C$25,0)","v":0},"N",{"$f":"IF(X39=\"o\",F39*'2. Prix actuels'!$C$27/100,0)","v":0},"O",{"$f":"IF(Z39=\"o\",F39*'2. Prix actuels'!$C$26/100,0)","v":15},0,0]
["Engins pour trois points",37,4.33,"Pulvérisateur",null,8700,{"$f":"IF(F40>0,F40*'2. Prix actuels'!$C$32/100,0)","v":435},{"$f":"IF(F40>0,'2. Prix actuels'!$C$30,0)","v":5},2000,10,1,null,{"$f":"_xlfn.IFS(L40=1,'2. Prix actuels'!$C$9,L40=2,'2. Prix actuels'!$C$10,L40=3,'2. Prix actuels'!$C$11,L40=4,'2. Prix actuels'!$C$12,L40<1,0)","v":0},null,{"$f":"_xlfn.IFS(N40=1,'2. Prix actuels'!$C$15,N40=2,'2. Prix actuels'!$C$16,N40=3,'2. Prix actuels'!$C$17,N40<1,0)","v":0},"O",{"$f":"IF(P40=\"o\",'2. Prix actuels'!$C$6,0)","v":55},"O",{"$f":"IF(R40=\"o\",IF('2. Prix actuels'!$C$21*F40/100<=6000,'2. Prix actuels'!$C$21*'4. Données de calcul'!F40/100,6000),0)","v":174},"N",{"$f":"IF(T40=\"o\",'2. Prix actuels'!$C$24,0)","v":0},"N",{"$f":"IF(V40=\"o\",'2. Prix actuels'!$C$25,0)","v":0},"N",{"$f":"IF(X40=\"o\",F40*'2. Prix actuels'!$C$27/100,0)","v":0},"O",{"$f":"IF(Z40=\"o\",F40*'2. Prix actuels'!$C$26/100,0)","v":17.399999999999999},0,0]
["Remorques",38,5.01,"Remorque à grue",null,69000,{"$f":"IF(F41>0,F41*'2. Prix actuels'!$C$32/100,0)","v":3450},{"$f":"IF(F41>0,'2. Prix actuels'!$C$30,0)","v":5},3000,8,1,null,{"$f":"_xlfn.IFS(L41=1,'2. Prix actuels'!$C$9,L41=2,'2. Prix actuels'!$C$10,L41=3,'2. Prix actuels'!$C$11,L41=4,'2. Prix actuels'!$C$12,L41<1,0)","v":0},1,{"$f":"_xlfn.IFS(N41=1,'2. Prix actuels'!$C$15,N41=2,'2. Prix actuels'!$C$16,N41=3,'2. Prix actuels'!$C$17,N41<1,0)","v":6.5},"O",{"$f":"IF(P41=\"o\",'2. Prix actuels'!$C$6,0)","v":55},"O",{"$f":"IF(R41=\"o\",IF('2. Prix actuels'!$C$21*F41/100<=6000,'2. Prix actuels'!$C$21*'4. Données de calcul'!F41/100,6000),0)","v":1380},"N",{"$f":"IF(T41=\"o\",'2. Prix actuels'!$C$24,0)","v":0},"N",{"$f":"IF(V41=\"o\",'2. Prix actuels'!$C$25,0)","v":0},"N",{"$f":"IF(X41=\"o\",F41*'2. Prix actuels'!$C$27/100,0)","v":0},"O",{"$f":"IF(Z41=\"o\",F41*'2. Prix actuels'!$C$26/100,0)","v":138},0,0.2]
["Remorques",39,5.0199999999999996,"Remorque de transport",null,15000,{"$f":"IF(F42>0,F42*'2. Prix actuels'!$C$32/100,0)","v":750},{"$f":"IF(F42>0,'2. Prix actuels'!$C$30,0)","v":5},3000,8,0.8,null,{"$f":"_xlfn.IFS(L42=1,'2. Prix actuels'!$C$9,L42=2,'2. Prix actuels'!$C$10,L42=3,'2. Prix actuels'!$C$11,L42=4,'2. Prix actuels'!$C$12,L42<1,0)","v":0},null,{"$f":"_xlfn.IFS(N42=1,'2. Prix actuels'!$C$15,N42=2,'2. Prix actuels'!$C$16,N42=3,'2. Prix actuels'!$C$17,N42<1,0)","v":0},"O",{"$f":"IF(P42=\"o\",'2. Prix actuels'!$C$6,0)","v":55},"O",{"$f":"IF(R42=\"o\",IF('2. Prix actuels'!$C$21*F42/100<=6000,'2. Prix actuels'!$C$21*'4. Données de calcul'!F42/100,6000),0)","v":300},"N",{"$f":"IF(T42=\"o\",'2. Prix actuels'!$C$24,0)","v":0},"N",{"$f":"IF(V42=\"o\",'2. Prix actuels'!$C$25,0)","v":0},"N",{"$f":"IF(X42=\"o\",F42*'2. Prix actuels'!$C$27/100,0)","v":0},"O",{"$f":"IF(Z42=\"o\",F42*'2. Prix actuels'!$C$26/100,0)","v":30},0,0]
["Téléphériques",40,6.11,"Installation conventionelle moyenne",30,135000,{"$f":"IF(F43>0,F43*'2. Prix actuels'!$C$32/100,0)","v":6750},{"$f":"IF(F43>0,'2. Prix actuels'!$C$30,0)","v":5},7000,7,0.7,1,{"$f":"_xlfn.IFS(L43=1,'2. Prix actuels'!$C$9,L43=2,'2. Prix actuels'!$C$10,L43=3,'2. Prix actuels'!$C$11,L43=4,'2. Prix actuels'!$C$12,L43<1,0)","v":1.65},1,{"$f":"_xlfn.IFS(N43=1,'2. Prix actuels'!$C$15,N43=2,'2. Prix actuels'!$C$16,N43=3,'2. Prix actuels'!$C$17,N43<1,0)","v":6.5},"O",{"$f":"IF(P43=\"o\",'2. Prix actuels'!$C$6,0)","v":55},"O",{"$f":"IF(R43=\"o\",IF('2. Prix actuels'!$C$21*F43/100<=6000,'2. Prix actuels'!$C$21*'4. Données de calcul'!F43/100,6000),0)","v":2700},"N",{"$f":"IF(T43=\"o\",'2. Prix actuels'!$C$24,0)","v":0},"O",{"$f":"IF(V43=\"o\",'2. Prix actuels'!$C$25,0)","v":290},"O",{"$f":"IF(X43=\"o\",F43*'2. Prix actuels'!$C$27/100,0)","v":3780},"N",{"$f":"IF(Z43=\"o\",F43*'2. Prix actuels'!$C$26/100,0)","v":0},3.6,0.12]
["Téléphériques",41,6.21,"Grue à câble mobile jusqu'à 300 m de câble",20,220000,{"$f":"IF(F44>0,F44*'2. Prix actuels'!$C$32/100,0)","v":11000},{"$f":"IF(F44>0,'2. Prix actuels'!$C$30,0)","v":5},7000,7,0.7,1,{"$f":"_xlfn.IFS(L44=1,'2. Prix actuels'!$C$9,L44=2,'2. Prix actuels'!$C$10,L44=3,'2. Prix actuels'!$C$11,L44=4,'2. Prix actuels'!$C$12,L44<1,0)","v":1.65},1,{"$f":"_xlfn.IFS(N44=1,'2. Prix actuels'!$C$15,N44=2,'2. Prix actuels'!$C$16,N44=3,'2. Prix actuels'!$C$17,N44<1,0)","v":6.5},"O",{"$f":"IF(P44=\"o\",'2. Prix actuels'!$C$6,0)","v":55},"O",{"$f":"IF(R44=\"o\",IF('2. Prix actuels'!$C$21*F44/100<=6000,'2. Prix actuels'!$C$21*'4. Données de calcul'!F44/100,6000),0)","v":4400},"O",{"$f":"IF(T44=\"o\",'2. Prix actuels'!$C$24,0)","v":100},"O",{"$f":"IF(V44=\"o\",'2. Prix actuels'!$C$25,0)","v":290},"O",{"$f":"IF(X44=\"o\",F44*'2. Prix actuels'!$C$27/100,0)","v":6160},"N",{"$f":"IF(Z44=\"o\",F44*'2. Prix actuels'!$C$26/100,0)","v":0},2.4,0.08]
["Téléphériques",42,6.22,"Grue à câble mobile jusqu'à 600 m de câble",30,280000,{"$f":"IF(F45>0,F45*'2. Prix actuels'!$C$32/100,0)","v":14000},{"$f":"IF(F45>0,'2. Prix actuels'!$C$30,0)","v":5},7000,7,0.7,1,{"$f":"_xlfn.IFS(L45=1,'2. Prix actuels'!$C$9,L45=2,'2. Prix actuels'!$C$10,L45=3,'2. Prix actuels'!$C$11,L45=4,'2. Prix actuels'!$C$12,L45<1,0)","v":1.65},1,{"$f":"_xlfn.IFS(N45=1,'2. Prix actuels'!$C$15,N45=2,'2. Prix actuels'!$C$16,N45=3,'2. Prix actuels'!$C$17,N45<1,0)","v":6.5},"O",{"$f":"IF(P45=\"o\",'2. Prix actuels'!$C$6,0)","v":55},"O",{"$f":"IF(R45=\"o\",IF('2. Prix actuels'!$C$21*F45/100<=6000,'2. Prix actuels'!$C$21*'4. Données de calcul'!F45/100,6000),0)","v":5600},"O",{"$f":"IF(T45=\"o\",'2. Prix actuels'!$C$24,0)","v":100},"O",{"$f":"IF(V45=\"o\",'2. Prix actuels'!$C$25,0)","v":290},"O",{"$f":"IF(X45=\"o\",F45*'2. Prix actuels'!$C$27/100,0)","v":7840},"N",{"$f":"IF(Z45=\"o\",F45*'2. Prix actuels'!$C$26/100,0)","v":0},3.6,0.12]
["Autres machines forestières",43,7.11,"Treuil sur luge commande radio, petits",20,28500,{"$f":"IF(F46>0,F46*'2. Prix actuels'!$C$32/100,0)","v":1425},{"$f":"IF(F46>0,'2. Prix actuels'!$C$30,0)","v":5},3000,7,1,2,{"$f":"_xlfn.IFS(L46=1,'2. Prix actuels'!$C$9,L46=2,'2. Prix actuels'!$C$10,L46=3,'2. Prix actuels'!$C$11,L46=4,'2. Prix actuels'!$C$12,L46<1,0)","v":1.6},1,{"$f":"_xlfn.IFS(N46=1,'2. Prix actuels'!$C$15,N46=2,'2. Prix actuels'!$C$16,N46=3,'2. Prix actuels'!$C$17,N46<1,0)","v":6.5},"O",{"$f":"IF(P46=\"o\",'2. Prix actuels'!$C$6,0)","v":55},"O",{"$f":"IF(R46=\"o\",IF('2. Prix actuels'!$C$21*F46/100<=6000,'2. Prix actuels'!$C$21*'4. Données de calcul'!F46/100,6000),0)","v":570},"O",{"$f":"IF(T46=\"o\",'2. Prix actuels'!$C$24,0)","v":100},"O",{"$f":"IF(V46=\"o\",'2. Prix actuels'!$C$25,0)","v":290},"O",{"$f":"IF(X46=\"o\",F46*'2. Prix actuels'!$C$27/100,0)","v":798},"O",{"$f":"IF(Z46=\"o\",F46*'2. Prix actuels'!$C$26/100,0)","v":57},2.4,0.08]
["Autres machines forestières",44,7.12,"Treuil sur luge commande radio, grands",30,46000,{"$f":"IF(F47>0,F47*'2. Prix actuels'!$C$32/100,0)","v":2300},{"$f":"IF(F47>0,'2. Prix actuels'!$C$30,0)","v":5},3000,7,1,1,{"$f":"_xlfn.IFS(L47=1,'2. Prix actuels'!$C$9,L47=2,'2. Prix actuels'!$C$10,L47=3,'2. Prix actuels'!$C$11,L47=4,'2. Prix actuels'!$C$12,L47<1,0)","v":1.65},1,{"$f":"_xlfn.IFS(N47=1,'2. Prix actuels'!$C$15,N47=2,'2. Prix actuels'!$C$16,N47=3,'2. Prix actuels'!$C$17,N47<1,0)","v":6.5},"O",{"$f":"IF(P47=\"o\",'2. Prix actuels'!$C$6,0)","v":55},"O",{"$f":"IF(R47=\"o\",IF('2. Prix actuels'!$C$21*F47/100<=6000,'2. Prix actuels'!$C$21*'4. Données de calcul'!F47/100,6000),0)","v":920},"O",{"$f":"IF(T47=\"o\",'2. Prix actuels'!$C$24,0)","v":100},"O",{"$f":"IF(V47=\"o\",'2. Prix actuels'!$C$25,0)","v":290},"O",{"$f":"IF(X47=\"o\",F47*'2. Prix actuels'!$C$27/100,0)","v":1287.9999999999998},"O",{"$f":"IF(Z47=\"o\",F47*'2. Prix actuels'!$C$26/100,0)","v":92},3.6,0.12]
["Autres machines forestières",45,7.21,"Scie à bois électrique circulaire",null,2700,{"$f":"IF(F48>0,F48*'2. Prix actuels'!$C$32/100,0)","v":135},{"$f":"IF(F48>0,'2. Prix actuels'!$C$30,0)","v":5},3000,10,1,null,{"$f":"_xlfn.IFS(L48=1,'2. Prix actuels'!$C$9,L48=2,'2. Prix actuels'!$C$10,L48=3,'2. Prix actuels'!$C$11,L48=4,'2. Prix actuels'!$C$12,L48<1,0)","v":0},null,{"$f":"_xlfn.IFS(N48=1,'2. Prix actuels'!$C$15,N48=2,'2. Prix actuels'!$C$16,N48=3,'2. Prix actuels'!$C$17,N48<1,0)","v":0},"O",{"$f":"IF(P48=\"o\",'2. Prix actuels'!$C$6,0)","v":55},"O",{"$f":"IF(R48=\"o\",IF('2. Prix actuels'!$C$21*F48/100<=6000,'2. Prix actuels'!$C$21*'4. Données de calcul'!F48/100,6000),0)","v":54},"N",{"$f":"IF(T48=\"o\",'2. Prix actuels'!$C$24,0)","v":0},"N",{"$f":"IF(V48=\"o\",'2. Prix actuels'!$C$25,0)","v":0},"N",{"$f":"IF(X48=\"o\",F48*'2. Prix actuels'!$C$27/100,0)","v":0},"O",{"$f":"IF(Z48=\"o\",F48*'2. Prix actuels'!$C$26/100,0)","v":5.4},0,0]
["Autres machines forestières",46,7.22,"Scie à bois électrique à ruban",null,3600,{"$f":"IF(F49>0,F49*'2. Prix actuels'!$C$32/100,0)","v":180},{"$f":"IF(F49>0,'2. Prix actuels'!$C$30,0)","v":5},4000,10,1.2,null,{"$f":"_xlfn.IFS(L49=1,'2. Prix actuels'!$C$9,L49=2,'2. Prix actuels'!$C$10,L49=3,'2. Prix actuels'!$C$11,L49=4,'2. Prix actuels'!$C$12,L49<1,0)","v":0},null,{"$f":"_xlfn.IFS(N49=1,'2. Prix actuels'!$C$15,N49=2,'2. Prix actuels'!$C$16,N49=3,'2. Prix actuels'!$C$17,N49<1,0)","v":0},"O",{"$f":"IF(P49=\"o\",'2. Prix actuels'!$C$6,0)","v":55},"O",{"$f":"IF(R49=\"o\",IF('2. Prix actuels'!$C$21*F49/100<=6000,'2. Prix actuels'!$C$21*'4. Données de calcul'!F49/100,6000),0)","v":72},"N",{"$f":"IF(T49=\"o\",'2. Prix actuels'!$C$24,0)","v":0},"N",{"$f":"IF(V49=\"o\",'2. Prix actuels'!$C$25,0)","v":0},"N",{"$f":"IF(X49=\"o\",F49*'2. Prix actuels'!$C$27/100,0)","v":0},"O",{"$f":"IF(Z49=\"o\",F49*'2. Prix actuels'!$C$26/100,0)","v":7.2},0,0]
["Autres machines forestières",47,7.31,"Déchiqueteuse petite, avec prise de force",null,14000,{"$f":"IF(F50>0,F50*'2. Prix actuels'!$C$32/100,0)","v":700},{"$f":"IF(F50>0,'2. Prix actuels'!$C$30,0)","v":5},3000,7,1,null,{"$f":"_xlfn.IFS(L50=1,'2. Prix actuels'!$C$9,L50=2,'2. Prix actuels'!$C$10,L50=3,'2. Prix actuels'!$C$11,L50=4,'2. Prix actuels'!$C$12,L50<1,0)","v":0},1,{"$f":"_xlfn.IFS(N50=1,'2. Prix actuels'!$C$15,N50=2,'2. Prix actuels'!$C$16,N50=3,'2. Prix actuels'!$C$17,N50<1,0)","v":6.5},"O",{"$f":"IF(P50=\"o\",'2. Prix actuels'!$C$6,0)","v":55},"O",{"$f":"IF(R50=\"o\",IF('2. Prix actuels'!$C$21*F50/100<=6000,'2. Prix actuels'!$C$21*'4. Données de calcul'!F50/100,6000),0)","v":280},"N",{"$f":"IF(T50=\"o\",'2. Prix actuels'!$C$24,0)","v":0},"N",{"$f":"IF(V50=\"o\",'2. Prix actuels'!$C$25,0)","v":0},"N",{"$f":"IF(X50=\"o\",F50*'2. Prix actuels'!$C$27/100,0)","v":0},"O",{"$f":"IF(Z50=\"o\",F50*'2. Prix actuels'!$C$26/100,0)","v":28},0,0]
["Autres machines forestières",48,7.32,"Déchiqueteuse moyenne, moteur électrique",20,25000,{"$f":"IF(F51>0,F51*'2. Prix actuels'!$C$32/100,0)","v":1250},{"$f":"IF(F51>0,'2. Prix actuels'!$C$30,0)","v":5},4000,7,1,null,{"$f":"_xlfn.IFS(L51=1,'2. Prix actuels'!$C$9,L51=2,'2. Prix actuels'!$C$10,L51=3,'2. Prix actuels'!$C$11,L51=4,'2. Prix actuels'!$C$12,L51<1,0)","v":0},1,{"$f":"_xlfn.IFS(N51=1,'2. Prix actuels'!$C$15,N51=2,'2. Prix actuels'!$C$16,N51=3,'2. Prix actuels'!$C$17,N51<1,0)","v":6.5},"O",{"$f":"IF(P51=\"o\",'2. Prix actuels'!$C$6,0)","v":55},"O",{"$f":"IF(R51=\"o\",IF('2. Prix actuels'!$C$21*F51/100<=6000,'2. Prix actuels'!$C$21*'4. Données de calcul'!F51/100,6000),0)","v":500},"N",{"$f":"IF(T51=\"o\",'2. Prix actuels'!$C$24,0)","v":0},"N",{"$f":"IF(V51=\"o\",'2. Prix actuels'!$C$25,0)","v":0},"N",{"$f":"IF(X51=\"o\",F51*'2. Prix actuels'!$C$27/100,0)","v":0},"O",{"$f":"IF(Z51=\"o\",F51*'2. Prix actuels'!$C$26/100,0)","v":50},0,0]
["Autres machines forestières",49,7.41,"Nettoyeur haute pression, moyen",4,6000,{"$f":"IF(F52>0,F52*'2. Prix actuels'!$C$32/100,0)","v":300},{"$f":"IF(F52>0,'2. Prix actuels'!$C$30,0)","v":5},1500,7,1,null,{"$f":"_xlfn.IFS(L52=1,'2. Prix actuels'!$C$9,L52=2,'2. Prix actuels'!$C$10,L52=3,'2. Prix actuels'!$C$11,L52=4,'2. Prix actuels'!$C$12,L52<1,0)","v":0},null,{"$f":"_xlfn.IFS(N52=1,'2. Prix actuels'!$C$15,N52=2,'2. Prix actuels'!$C$16,N52=3,'2. Prix actuels'!$C$17,N52<1,0)","v":0},"O",{"$f":"IF(P52=\"o\",'2. Prix actuels'!$C$6,0)","v":55},"O",{"$f":"IF(R52=\"o\",IF('2. Prix actuels'!$C$21*F52/100<=6000,'2. Prix actuels'!$C$21*'4. Données de calcul'!F52/100,6000),0)","v":120},"N",{"$f":"IF(T52=\"o\",'2. Prix actuels'!$C$24,0)","v":0},"N",{"$f":"IF(V52=\"o\",'2. Prix actuels'!$C$25,0)","v":0},"N",{"$f":"IF(X52=\"o\",F52*'2. Prix actuels'!$C$27/100,0)","v":0},"O",{"$f":"IF(Z52=\"o\",F52*'2. Prix actuels'!$C$26/100,0)","v":12},0,0]
["Propres machines",50,10.01,"Libre 1",null,null,{"$f":"IF(F53>0,F53*'2. Prix actuels'!$C$32/100,0)","v":0},{"$f":"IF(F53>0,'2. Prix actuels'!$C$30,0)","v":0},null,null,null,null,{"$f":"_xlfn.IFS(L53=1,'2. Prix actuels'!$C$9,L53=2,'2. Prix actuels'!$C$10,L53=3,'2. Prix actuels'!$C$11,L53=4,'2. Prix actuels'!$C$12,L53<1,0)","v":0},null,{"$f":"_xlfn.IFS(N53=1,'2. Prix actuels'!$C$15,N53=2,'2. Prix actuels'!$C$16,N53=3,'2. Prix actuels'!$C$17,N53<1,0)","v":0},null,{"$f":"IF(P53=\"o\",'2. Prix actuels'!$C$6,0)","v":0},null,{"$f":"IF(R53=\"o\",IF('2. Prix actuels'!$C$21*F53/100<=6000,'2. Prix actuels'!$C$21*'4. Données de calcul'!F53/100,6000),0)","v":0},null,{"$f":"IF(T53=\"o\",'2. Prix actuels'!$C$24,0)","v":0},null,{"$f":"IF(V53=\"o\",'2. Prix actuels'!$C$25,0)","v":0},null,{"$f":"IF(X53=\"o\",F53*'2. Prix actuels'!$C$27/100,0)","v":0},null,{"$f":"IF(Z53=\"o\",F53*'2. Prix actuels'!$C$26/100,0)","v":0},0,0]
["Propres machines",51,10.02,"Libre 2",null,null,{"$f":"IF(F54>0,F54*'2. Prix actuels'!$C$32/100,0)","v":0},{"$f":"IF(F54>0,'2. Prix actuels'!$C$30,0)","v":0},null,null,null,null,{"$f":"_xlfn.IFS(L54=1,'2. Prix actuels'!$C$9,L54=2,'2. Prix actuels'!$C$10,L54=3,'2. Prix actuels'!$C$11,L54=4,'2. Prix actuels'!$C$12,L54<1,0)","v":0},null,{"$f":"_xlfn.IFS(N54=1,'2. Prix actuels'!$C$15,N54=2,'2. Prix actuels'!$C$16,N54=3,'2. Prix actuels'!$C$17,N54<1,0)","v":0},null,{"$f":"IF(P54=\"o\",'2. Prix actuels'!$C$6,0)","v":0},null,{"$f":"IF(R54=\"o\",IF('2. Prix actuels'!$C$21*F54/100<=6000,'2. Prix actuels'!$C$21*'4. Données de calcul'!F54/100,6000),0)","v":0},null,{"$f":"IF(T54=\"o\",'2. Prix actuels'!$C$24,0)","v":0},null,{"$f":"IF(V54=\"o\",'2. Prix actuels'!$C$25,0)","v":0},null,{"$f":"IF(X54=\"o\",F54*'2. Prix actuels'!$C$27/100,0)","v":0},null,{"$f":"IF(Z54=\"o\",F54*'2. Prix actuels'!$C$26/100,0)","v":0},0,0]
["Propres machines",52,10.029999999999999,"Libre 3",null,null,{"$f":"IF(F55>0,F55*'2. Prix actuels'!$C$32/100,0)","v":0},{"$f":"IF(F55>0,'2. Prix actuels'!$C$30,0)","v":0},null,null,null,null,{"$f":"_xlfn.IFS(L55=1,'2. Prix actuels'!$C$9,L55=2,'2. Prix actuels'!$C$10,L55=3,'2. Prix actuels'!$C$11,L55=4,'2. Prix actuels'!$C$12,L55<1,0)","v":0},null,{"$f":"_xlfn.IFS(N55=1,'2. Prix actuels'!$C$15,N55=2,'2. Prix actuels'!$C$16,N55=3,'2. Prix actuels'!$C$17,N55<1,0)","v":0},null,{"$f":"IF(P55=\"o\",'2. Prix actuels'!$C$6,0)","v":0},null,{"$f":"IF(R55=\"o\",IF('2. Prix actuels'!$C$21*F55/100<=6000,'2. Prix actuels'!$C$21*'4. Données de calcul'!F55/100,6000),0)","v":0},null,{"$f":"IF(T55=\"o\",'2. Prix actuels'!$C$24,0)","v":0},null,{"$f":"IF(V55=\"o\",'2. Prix actuels'!$C$25,0)","v":0},null,{"$f":"IF(X55=\"o\",F55*'2. Prix actuels'!$C$27/100,0)","v":0},null,{"$f":"IF(Z55=\"o\",F55*'2. Prix actuels'!$C$26/100,0)","v":0},0,0]
["Propres machines",53,10.039999999999999,"Libre 4",null,null,{"$f":"IF(F56>0,F56*'2. Prix actuels'!$C$32/100,0)","v":0},{"$f":"IF(F56>0,'2. Prix actuels'!$C$30,0)","v":0},null,null,null,null,{"$f":"_xlfn.IFS(L56=1,'2. Prix actuels'!$C$9,L56=2,'2. Prix actuels'!$C$10,L56=3,'2. Prix actuels'!$C$11,L56=4,'2. Prix actuels'!$C$12,L56<1,0)","v":0},null,{"$f":"_xlfn.IFS(N56=1,'2. Prix actuels'!$C$15,N56=2,'2. Prix actuels'!$C$16,N56=3,'2. Prix actuels'!$C$17,N56<1,0)","v":0},null,{"$f":"IF(P56=\"o\",'2. Prix actuels'!$C$6,0)","v":0},null,{"$f":"IF(R56=\"o\",IF('2. Prix actuels'!$C$21*F56/100<=6000,'2. Prix actuels'!$C$21*'4. Données de calcul'!F56/100,6000),0)","v":0},null,{"$f":"IF(T56=\"o\",'2. Prix actuels'!$C$24,0)","v":0},null,{"$f":"IF(V56=\"o\",'2. Prix actuels'!$C$25,0)","v":0},null,{"$f":"IF(X56=\"o\",F56*'2. Prix actuels'!$C$27/100,0)","v":0},null,{"$f":"IF(Z56=\"o\",F56*'2. Prix actuels'!$C$26/100,0)","v":0},0,0]
["Propres machines",54,10.050000000000001,"Libre 5",null,null,{"$f":"IF(F57>0,F57*'2. Prix actuels'!$C$32/100,0)","v":0},{"$f":"IF(F57>0,'2. Prix actuels'!$C$30,0)","v":0},null,null,null,null,{"$f":"_xlfn.IFS(L57=1,'2. Prix actuels'!$C$9,L57=2,'2. Prix actuels'!$C$10,L57=3,'2. Prix actuels'!$C$11,L57=4,'2. Prix actuels'!$C$12,L57<1,0)","v":0},null,{"$f":"_xlfn.IFS(N57=1,'2. Prix actuels'!$C$15,N57=2,'2. Prix actuels'!$C$16,N57=3,'2. Prix actuels'!$C$17,N57<1,0)","v":0},null,{"$f":"IF(P57=\"o\",'2. Prix actuels'!$C$6,0)","v":0},null,{"$f":"IF(R57=\"o\",IF('2. Prix actuels'!$C$21*F57/100<=6000,'2. Prix actuels'!$C$21*'4. Données de calcul'!F57/100,6000),0)","v":0},null,{"$f":"IF(T57=\"o\",'2. Prix actuels'!$C$24,0)","v":0},null,{"$f":"IF(V57=\"o\",'2. Prix actuels'!$C$25,0)","v":0},null,{"$f":"IF(X57=\"o\",F57*'2. Prix actuels'!$C$27/100,0)","v":0},null,{"$f":"IF(Z57=\"o\",F57*'2. Prix actuels'!$C$26/100,0)","v":0},0,0]
["Propres machines",55,10.06,"Libre 6",null,null,{"$f":"IF(F58>0,F58*'2. Prix actuels'!$C$32/100,0)","v":0},{"$f":"IF(F58>0,'2. Prix actuels'!$C$30,0)","v":0},null,null,null,null,{"$f":"_xlfn.IFS(L58=1,'2. Prix actuels'!$C$9,L58=2,'2. Prix actuels'!$C$10,L58=3,'2. Prix actuels'!$C$11,L58=4,'2. Prix actuels'!$C$12,L58<1,0)","v":0},null,{"$f":"_xlfn.IFS(N58=1,'2. Prix actuels'!$C$15,N58=2,'2. Prix actuels'!$C$16,N58=3,'2. Prix actuels'!$C$17,N58<1,0)","v":0},null,{"$f":"IF(P58=\"o\",'2. Prix actuels'!$C$6,0)","v":0},null,{"$f":"IF(R58=\"o\",IF('2. Prix actuels'!$C$21*F58/100<=6000,'2. Prix actuels'!$C$21*'4. Données de calcul'!F58/100,6000),0)","v":0},null,{"$f":"IF(T58=\"o\",'2. Prix actuels'!$C$24,0)","v":0},null,{"$f":"IF(V58=\"o\",'2. Prix actuels'!$C$25,0)","v":0},null,{"$f":"IF(X58=\"o\",F58*'2. Prix actuels'!$C$27/100,0)","v":0},null,{"$f":"IF(Z58=\"o\",F58*'2. Prix actuels'!$C$26/100,0)","v":0},0,0]
["Propres machines",56,10.07,"Libre 7",null,null,{"$f":"IF(F59>0,F59*'2. Prix actuels'!$C$32/100,0)","v":0},{"$f":"IF(F59>0,'2. Prix actuels'!$C$30,0)","v":0},null,null,null,null,{"$f":"_xlfn.IFS(L59=1,'2. Prix actuels'!$C$9,L59=2,'2. Prix actuels'!$C$10,L59=3,'2. Prix actuels'!$C$11,L59=4,'2. Prix actuels'!$C$12,L59<1,0)","v":0},null,{"$f":"_xlfn.IFS(N59=1,'2. Prix actuels'!$C$15,N59=2,'2. Prix actuels'!$C$16,N59=3,'2. Prix actuels'!$C$17,N59<1,0)","v":0},null,{"$f":"IF(P59=\"o\",'2. Prix actuels'!$C$6,0)","v":0},null,{"$f":"IF(R59=\"o\",IF('2. Prix actuels'!$C$21*F59/100<=6000,'2. Prix actuels'!$C$21*'4. Données de calcul'!F59/100,6000),0)","v":0},null,{"$f":"IF(T59=\"o\",'2. Prix actuels'!$C$24,0)","v":0},null,{"$f":"IF(V59=\"o\",'2. Prix actuels'!$C$25,0)","v":0},null,{"$f":"IF(X59=\"o\",F59*'2. Prix actuels'!$C$27/100,0)","v":0},null,{"$f":"IF(Z59=\"o\",F59*'2. Prix actuels'!$C$26/100,0)","v":0},0,0]
["Propres machines",57,10.08,"Libre 8",null,null,{"$f":"IF(F60>0,F60*'2. Prix actuels'!$C$32/100,0)","v":0},{"$f":"IF(F60>0,'2. Prix actuels'!$C$30,0)","v":0},null,null,null,null,{"$f":"_xlfn.IFS(L60=1,'2. Prix actuels'!$C$9,L60=2,'2. Prix actuels'!$C$10,L60=3,'2. Prix actuels'!$C$11,L60=4,'2. Prix actuels'!$C$12,L60<1,0)","v":0},null,{"$f":"_xlfn.IFS(N60=1,'2. Prix actuels'!$C$15,N60=2,'2. Prix actuels'!$C$16,N60=3,'2. Prix actuels'!$C$17,N60<1,0)","v":0},null,{"$f":"IF(P60=\"o\",'2. Prix actuels'!$C$6,0)","v":0},null,{"$f":"IF(R60=\"o\",IF('2. Prix actuels'!$C$21*F60/100<=6000,'2. Prix actuels'!$C$21*'4. Données de calcul'!F60/100,6000),0)","v":0},null,{"$f":"IF(T60=\"o\",'2. Prix actuels'!$C$24,0)","v":0},null,{"$f":"IF(V60=\"o\",'2. Prix actuels'!$C$25,0)","v":0},null,{"$f":"IF(X60=\"o\",F60*'2. Prix actuels'!$C$27/100,0)","v":0},null,{"$f":"IF(Z60=\"o\",F60*'2. Prix actuels'!$C$26/100,0)","v":0},0,0]
["Propres machines",58,10.09,"Libre 9",null,null,{"$f":"IF(F61>0,F61*'2. Prix actuels'!$C$32/100,0)","v":0},{"$f":"IF(F61>0,'2. Prix actuels'!$C$30,0)","v":0},null,null,null,null,{"$f":"_xlfn.IFS(L61=1,'2. Prix actuels'!$C$9,L61=2,'2. Prix actuels'!$C$10,L61=3,'2. Prix actuels'!$C$11,L61=4,'2. Prix actuels'!$C$12,L61<1,0)","v":0},null,{"$f":"_xlfn.IFS(N61=1,'2. Prix actuels'!$C$15,N61=2,'2. Prix actuels'!$C$16,N61=3,'2. Prix actuels'!$C$17,N61<1,0)","v":0},null,{"$f":"IF(P61=\"o\",'2. Prix actuels'!$C$6,0)","v":0},null,{"$f":"IF(R61=\"o\",IF('2. Prix actuels'!$C$21*F61/100<=6000,'2. Prix actuels'!$C$21*'4. Données de calcul'!F61/100,6000),0)","v":0},null,{"$f":"IF(T61=\"o\",'2. Prix actuels'!$C$24,0)","v":0},null,{"$f":"IF(V61=\"o\",'2. Prix actuels'!$C$25,0)","v":0},null,{"$f":"IF(X61=\"o\",F61*'2. Prix actuels'!$C$27/100,0)","v":0},null,{"$f":"IF(Z61=\"o\",F61*'2. Prix actuels'!$C$26/100,0)","v":0},0,0]
["Propres machines",59,10.1,"Libre 10",null,null,{"$f":"IF(F62>0,F62*'2. Prix actuels'!$C$32/100,0)","v":0},{"$f":"IF(F62>0,'2. Prix actuels'!$C$30,0)","v":0},null,null,null,null,{"$f":"_xlfn.IFS(L62=1,'2. Prix actuels'!$C$9,L62=2,'2. Prix actuels'!$C$10,L62=3,'2. Prix actuels'!$C$11,L62=4,'2. Prix actuels'!$C$12,L62<1,0)","v":0},null,{"$f":"_xlfn.IFS(N62=1,'2. Prix actuels'!$C$15,N62=2,'2. Prix actuels'!$C$16,N62=3,'2. Prix actuels'!$C$17,N62<1,0)","v":0},null,{"$f":"IF(P62=\"o\",'2. Prix actuels'!$C$6,0)","v":0},null,{"$f":"IF(R62=\"o\",IF('2. Prix actuels'!$C$21*F62/100<=6000,'2. Prix actuels'!$C$21*'4. Données de calcul'!F62/100,6000),0)","v":0},null,{"$f":"IF(T62=\"o\",'2. Prix actuels'!$C$24,0)","v":0},null,{"$f":"IF(V62=\"o\",'2. Prix actuels'!$C$25,0)","v":0},null,{"$f":"IF(X62=\"o\",F62*'2. Prix actuels'!$C$27/100,0)","v":0},null,{"$f":"IF(Z62=\"o\",F62*'2. Prix actuels'!$C$26/100,0)","v":0},0,0]
["Propres machines",60,10.11,"Libre 11",null,null,{"$f":"IF(F63>0,F63*'2. Prix actuels'!$C$32/100,0)","v":0},{"$f":"IF(F63>0,'2. Prix actuels'!$C$30,0)","v":0},null,null,null,null,{"$f":"_xlfn.IFS(L63=1,'2. Prix actuels'!$C$9,L63=2,'2. Prix actuels'!$C$10,L63=3,'2. Prix actuels'!$C$11,L63=4,'2. Prix actuels'!$C$12,L63<1,0)","v":0},null,{"$f":"_xlfn.IFS(N63=1,'2. Prix actuels'!$C$15,N63=2,'2. Prix actuels'!$C$16,N63=3,'2. Prix actuels'!$C$17,N63<1,0)","v":0},null,{"$f":"IF(P63=\"o\",'2. Prix actuels'!$C$6,0)","v":0},null,{"$f":"IF(R63=\"o\",IF('2. Prix actuels'!$C$21*F63/100<=6000,'2. Prix actuels'!$C$21*'4. Données de calcul'!F63/100,6000),0)","v":0},null,{"$f":"IF(T63=\"o\",'2. Prix actuels'!$C$24,0)","v":0},null,{"$f":"IF(V63=\"o\",'2. Prix actuels'!$C$25,0)","v":0},null,{"$f":"IF(X63=\"o\",F63*'2. Prix actuels'!$C$27/100,0)","v":0},null,{"$f":"IF(Z63=\"o\",F63*'2. Prix actuels'!$C$26/100,0)","v":0},0,0]
["Propres machines",61,10.119999999999999,"Libre 12",null,null,{"$f":"IF(F64>0,F64*'2. Prix actuels'!$C$32/100,0)","v":0},{"$f":"IF(F64>0,'2. Prix actuels'!$C$30,0)","v":0},null,null,null,null,{"$f":"_xlfn.IFS(L64=1,'2. Prix actuels'!$C$9,L64=2,'2. Prix actuels'!$C$10,L64=3,'2. Prix actuels'!$C$11,L64=4,'2. Prix actuels'!$C$12,L64<1,0)","v":0},null,{"$f":"_xlfn.IFS(N64=1,'2. Prix actuels'!$C$15,N64=2,'2. Prix actuels'!$C$16,N64=3,'2. Prix actuels'!$C$17,N64<1,0)","v":0},null,{"$f":"IF(P64=\"o\",'2. Prix actuels'!$C$6,0)","v":0},null,{"$f":"IF(R64=\"o\",IF('2. Prix actuels'!$C$21*F64/100<=6000,'2. Prix actuels'!$C$21*'4. Données de calcul'!F64/100,6000),0)","v":0},null,{"$f":"IF(T64=\"o\",'2. Prix actuels'!$C$24,0)","v":0},null,{"$f":"IF(V64=\"o\",'2. Prix actuels'!$C$25,0)","v":0},null,{"$f":"IF(X64=\"o\",F64*'2. Prix actuels'!$C$27/100,0)","v":0},null,{"$f":"IF(Z64=\"o\",F64*'2. Prix actuels'!$C$26/100,0)","v":0},0,0]
["Propres machines",62,10.130000000000001,"Libre 13",null,null,{"$f":"IF(F65>0,F65*'2. Prix actuels'!$C$32/100,0)","v":0},{"$f":"IF(F65>0,'2. Prix actuels'!$C$30,0)","v":0},null,null,null,null,{"$f":"_xlfn.IFS(L65=1,'2. Prix actuels'!$C$9,L65=2,'2. Prix actuels'!$C$10,L65=3,'2. Prix actuels'!$C$11,L65=4,'2. Prix actuels'!$C$12,L65<1,0)","v":0},null,{"$f":"_xlfn.IFS(N65=1,'2. Prix actuels'!$C$15,N65=2,'2. Prix actuels'!$C$16,N65=3,'2. Prix actuels'!$C$17,N65<1,0)","v":0},null,{"$f":"IF(P65=\"o\",'2. Prix actuels'!$C$6,0)","v":0},null,{"$f":"IF(R65=\"o\",IF('2. Prix actuels'!$C$21*F65/100<=6000,'2. Prix actuels'!$C$21*'4. Données de calcul'!F65/100,6000),0)","v":0},null,{"$f":"IF(T65=\"o\",'2. Prix actuels'!$C$24,0)","v":0},null,{"$f":"IF(V65=\"o\",'2. Prix actuels'!$C$25,0)","v":0},null,{"$f":"IF(X65=\"o\",F65*'2. Prix actuels'!$C$27/100,0)","v":0},null,{"$f":"IF(Z65=\"o\",F65*'2. Prix actuels'!$C$26/100,0)","v":0},0,0]
["Propres machines",63,10.14,"Libre 14",null,null,{"$f":"IF(F66>0,F66*'2. Prix actuels'!$C$32/100,0)","v":0},{"$f":"IF(F66>0,'2. Prix actuels'!$C$30,0)","v":0},null,null,null,null,{"$f":"_xlfn.IFS(L66=1,'2. Prix actuels'!$C$9,L66=2,'2. Prix actuels'!$C$10,L66=3,'2. Prix actuels'!$C$11,L66=4,'2. Prix actuels'!$C$12,L66<1,0)","v":0},null,{"$f":"_xlfn.IFS(N66=1,'2. Prix actuels'!$C$15,N66=2,'2. Prix actuels'!$C$16,N66=3,'2. Prix actuels'!$C$17,N66<1,0)","v":0},null,{"$f":"IF(P66=\"o\",'2. Prix actuels'!$C$6,0)","v":0},null,{"$f":"IF(R66=\"o\",IF('2. Prix actuels'!$C$21*F66/100<=6000,'2. Prix actuels'!$C$21*'4. Données de calcul'!F66/100,6000),0)","v":0},null,{"$f":"IF(T66=\"o\",'2. Prix actuels'!$C$24,0)","v":0},null,{"$f":"IF(V66=\"o\",'2. Prix actuels'!$C$25,0)","v":0},null,{"$f":"IF(X66=\"o\",F66*'2. Prix actuels'!$C$27/100,0)","v":0},null,{"$f":"IF(Z66=\"o\",F66*'2. Prix actuels'!$C$26/100,0)","v":0},0,0]
["Propres machines",64,10.15,"Libre 15",null,null,{"$f":"IF(F67>0,F67*'2. Prix actuels'!$C$32/100,0)","v":0},{"$f":"IF(F67>0,'2. Prix actuels'!$C$30,0)","v":0},null,null,null,null,{"$f":"_xlfn.IFS(L67=1,'2. Prix actuels'!$C$9,L67=2,'2. Prix actuels'!$C$10,L67=3,'2. Prix actuels'!$C$11,L67=4,'2. Prix actuels'!$C$12,L67<1,0)","v":0},null,{"$f":"_xlfn.IFS(N67=1,'2. Prix actuels'!$C$15,N67=2,'2. Prix actuels'!$C$16,N67=3,'2. Prix actuels'!$C$17,N67<1,0)","v":0},null,{"$f":"IF(P67=\"o\",'2. Prix actuels'!$C$6,0)","v":0},null,{"$f":"IF(R67=\"o\",IF('2. Prix actuels'!$C$21*F67/100<=6000,'2. Prix actuels'!$C$21*'4. Données de calcul'!F67/100,6000),0)","v":0},null,{"$f":"IF(T67=\"o\",'2. Prix actuels'!$C$24,0)","v":0},null,{"$f":"IF(V67=\"o\",'2. Prix actuels'!$C$25,0)","v":0},null,{"$f":"IF(X67=\"o\",F67*'2. Prix actuels'!$C$27/100,0)","v":0},null,{"$f":"IF(Z67=\"o\",F67*'2. Prix actuels'!$C$26/100,0)","v":0},0,0]
["Propres machines",65,10.16,"Libre 16",null,null,{"$f":"IF(F68>0,F68*'2. Prix actuels'!$C$32/100,0)","v":0},{"$f":"IF(F68>0,'2. Prix actuels'!$C$30,0)","v":0},null,null,null,null,{"$f":"_xlfn.IFS(L68=1,'2. Prix actuels'!$C$9,L68=2,'2. Prix actuels'!$C$10,L68=3,'2. Prix actuels'!$C$11,L68=4,'2. Prix actuels'!$C$12,L68<1,0)","v":0},null,{"$f":"_xlfn.IFS(N68=1,'2. Prix actuels'!$C$15,N68=2,'2. Prix actuels'!$C$16,N68=3,'2. Prix actuels'!$C$17,N68<1,0)","v":0},null,{"$f":"IF(P68=\"o\",'2. Prix actuels'!$C$6,0)","v":0},null,{"$f":"IF(R68=\"o\",IF('2. Prix actuels'!$C$21*F68/100<=6000,'2. Prix actuels'!$C$21*'4. Données de calcul'!F68/100,6000),0)","v":0},null,{"$f":"IF(T68=\"o\",'2. Prix actuels'!$C$24,0)","v":0},null,{"$f":"IF(V68=\"o\",'2. Prix actuels'!$C$25,0)","v":0},null,{"$f":"IF(X68=\"o\",F68*'2. Prix actuels'!$C$27/100,0)","v":0},null,{"$f":"IF(Z68=\"o\",F68*'2. Prix actuels'!$C$26/100,0)","v":0},0,0]
["Propres machines",66,10.17,"Libre 17",null,null,{"$f":"IF(F69>0,F69*'2. Prix actuels'!$C$32/100,0)","v":0},{"$f":"IF(F69>0,'2. Prix actuels'!$C$30,0)","v":0},null,null,null,null,{"$f":"_xlfn.IFS(L69=1,'2. Prix actuels'!$C$9,L69=2,'2. Prix actuels'!$C$10,L69=3,'2. Prix actuels'!$C$11,L69=4,'2. Prix actuels'!$C$12,L69<1,0)","v":0},null,{"$f":"_xlfn.IFS(N69=1,'2. Prix actuels'!$C$15,N69=2,'2. Prix actuels'!$C$16,N69=3,'2. Prix actuels'!$C$17,N69<1,0)","v":0},null,{"$f":"IF(P69=\"o\",'2. Prix actuels'!$C$6,0)","v":0},null,{"$f":"IF(R69=\"o\",IF('2. Prix actuels'!$C$21*F69/100<=6000,'2. Prix actuels'!$C$21*'4. Données de calcul'!F69/100,6000),0)","v":0},null,{"$f":"IF(T69=\"o\",'2. Prix actuels'!$C$24,0)","v":0},null,{"$f":"IF(V69=\"o\",'2. Prix actuels'!$C$25,0)","v":0},null,{"$f":"IF(X69=\"o\",F69*'2. Prix actuels'!$C$27/100,0)","v":0},null,{"$f":"IF(Z69=\"o\",F69*'2. Prix actuels'!$C$26/100,0)","v":0},0,0]
["Propres machines",67,10.18,"Libre 18",null,null,{"$f":"IF(F70>0,F70*'2. Prix actuels'!$C$32/100,0)","v":0},{"$f":"IF(F70>0,'2. Prix actuels'!$C$30,0)","v":0},null,null,null,null,{"$f":"_xlfn.IFS(L70=1,'2. Prix actuels'!$C$9,L70=2,'2. Prix actuels'!$C$10,L70=3,'2. Prix actuels'!$C$11,L70=4,'2. Prix actuels'!$C$12,L70<1,0)","v":0},null,{"$f":"_xlfn.IFS(N70=1,'2. Prix actuels'!$C$15,N70=2,'2. Prix actuels'!$C$16,N70=3,'2. Prix actuels'!$C$17,N70<1,0)","v":0},null,{"$f":"IF(P70=\"o\",'2. Prix actuels'!$C$6,0)","v":0},null,{"$f":"IF(R70=\"o\",IF('2. Prix actuels'!$C$21*F70/100<=6000,'2. Prix actuels'!$C$21*'4. Données de calcul'!F70/100,6000),0)","v":0},null,{"$f":"IF(T70=\"o\",'2. Prix actuels'!$C$24,0)","v":0},null,{"$f":"IF(V70=\"o\",'2. Prix actuels'!$C$25,0)","v":0},null,{"$f":"IF(X70=\"o\",F70*'2. Prix actuels'!$C$27/100,0)","v":0},null,{"$f":"IF(Z70=\"o\",F70*'2. Prix actuels'!$C$26/100,0)","v":0},0,0]
["Propres machines",68,10.19,"Libre 19",null,null,{"$f":"IF(F71>0,F71*'2. Prix actuels'!$C$32/100,0)","v":0},{"$f":"IF(F71>0,'2. Prix actuels'!$C$30,0)","v":0},null,null,null,null,{"$f":"_xlfn.IFS(L71=1,'2. Prix actuels'!$C$9,L71=2,'2. Prix actuels'!$C$10,L71=3,'2. Prix actuels'!$C$11,L71=4,'2. Prix actuels'!$C$12,L71<1,0)","v":0},null,{"$f":"_xlfn.IFS(N71=1,'2. Prix actuels'!$C$15,N71=2,'2. Prix actuels'!$C$16,N71=3,'2. Prix actuels'!$C$17,N71<1,0)","v":0},null,{"$f":"IF(P71=\"o\",'2. Prix actuels'!$C$6,0)","v":0},null,{"$f":"IF(R71=\"o\",IF('2. Prix actuels'!$C$21*F71/100<=6000,'2. Prix actuels'!$C$21*'4. Données de calcul'!F71/100,6000),0)","v":0},null,{"$f":"IF(T71=\"o\",'2. Prix actuels'!$C$24,0)","v":0},null,{"$f":"IF(V71=\"o\",'2. Prix actuels'!$C$25,0)","v":0},null,{"$f":"IF(X71=\"o\",F71*'2. Prix actuels'!$C$27/100,0)","v":0},null,{"$f":"IF(Z71=\"o\",F71*'2. Prix actuels'!$C$26/100,0)","v":0},0,0]
["Propres machines",69,10.199999999999999,"Libre 20",null,null,{"$f":"IF(F72>0,F72*'2. Prix actuels'!$C$32/100,0)","v":0},{"$f":"IF(F72>0,'2. Prix actuels'!$C$30,0)","v":0},null,null,null,null,{"$f":"_xlfn.IFS(L72=1,'2. Prix actuels'!$C$9,L72=2,'2. Prix actuels'!$C$10,L72=3,'2. Prix actuels'!$C$11,L72=4,'2. Prix actuels'!$C$12,L72<1,0)","v":0},null,{"$f":"_xlfn.IFS(N72=1,'2. Prix actuels'!$C$15,N72=2,'2. Prix actuels'!$C$16,N72=3,'2. Prix actuels'!$C$17,N72<1,0)","v":0},null,{"$f":"IF(P72=\"o\",'2. Prix actuels'!$C$6,0)","v":0},null,{"$f":"IF(R72=\"o\",IF('2. Prix actuels'!$C$21*F72/100<=6000,'2. Prix actuels'!$C$21*'4. Données de calcul'!F72/100,6000),0)","v":0},null,{"$f":"IF(T72=\"o\",'2. Prix actuels'!$C$24,0)","v":0},null,{"$f":"IF(V72=\"o\",'2. Prix actuels'!$C$25,0)","v":0},null,{"$f":"IF(X72=\"o\",F72*'2. Prix actuels'!$C$27/100,0)","v":0},null,{"$f":"IF(Z72=\"o\",F72*'2. Prix actuels'!$C$26/100,0)","v":0},0,0]
["Propres machines",70,10.210000000000001,"Libre 21",null,null,{"$f":"IF(F73>0,F73*'2. Prix actuels'!$C$32/100,0)","v":0},{"$f":"IF(F73>0,'2. Prix actuels'!$C$30,0)","v":0},null,null,null,null,{"$f":"_xlfn.IFS(L73=1,'2. Prix actuels'!$C$9,L73=2,'2. Prix actuels'!$C$10,L73=3,'2. Prix actuels'!$C$11,L73=4,'2. Prix actuels'!$C$12,L73<1,0)","v":0},null,{"$f":"_xlfn.IFS(N73=1,'2. Prix actuels'!$C$15,N73=2,'2. Prix actuels'!$C$16,N73=3,'2. Prix actuels'!$C$17,N73<1,0)","v":0},null,{"$f":"IF(P73=\"o\",'2. Prix actuels'!$C$6,0)","v":0},null,{"$f":"IF(R73=\"o\",IF('2. Prix actuels'!$C$21*F73/100<=6000,'2. Prix actuels'!$C$21*'4. Données de calcul'!F73/100,6000),0)","v":0},null,{"$f":"IF(T73=\"o\",'2. Prix actuels'!$C$24,0)","v":0},null,{"$f":"IF(V73=\"o\",'2. Prix actuels'!$C$25,0)","v":0},null,{"$f":"IF(X73=\"o\",F73*'2. Prix actuels'!$C$27/100,0)","v":0},null,{"$f":"IF(Z73=\"o\",F73*'2. Prix actuels'!$C$26/100,0)","v":0},0,0]
[null,71,null,"Sélectionnez un objet",0,0,0,0,0,0,0,0,0,0,0,0,0,0,0,0,0,0,0,0,0,0,0,0,0]

{"sheet":"5. Granph. frais totaux","index":4,"n_rows":14,"n_cols":3,"rows_kept":14,"cut":false,"hidden":false,"merged":[]}
[]
[null,"Propriétaire :",{"$f":"'2. Prix actuels'!C1","v":0}]
[]
["Frais totaux de l'ensemble des machines sélectionnées"]
[]
[{"$f":"INDEX('4. Données de calcul'!$D$4:$D$74,MATCH('3. Coûts des machines'!$D$3,'4. Données de calcul'!$B$4:$B$74))","v":"Sélectionnez un objet"}]
[{"$f":"INDEX('4. Données de calcul'!$D$4:$D$74,MATCH('3. Coûts des machines'!$E$3,'4. Données de calcul'!$B$4:$B$74))","v":"Sélectionnez un objet"}]
[{"$f":"INDEX('4. Données de calcul'!$D$4:$D$74,MATCH('3. Coûts des machines'!$F$3,'4. Données de calcul'!$B$4:$B$74))","v":"Sélectionnez un objet"}]
[{"$f":"INDEX('4. Données de calcul'!$D$4:$D$74,MATCH('3. Coûts des machines'!$G$3,'4. Données de calcul'!$B$4:$B$74))","v":"Sélectionnez un objet"}]
[]
["Frais fixes annuels",{"$f":"'3. Coûts des machines'!H35","v":0}]
["Frais variables par heure d'utilisation",{"$f":"'3. Coûts des machines'!H46","v":0}]
["Coût de revient total par heure d'utilisation",{"$f":"'3. Coûts des machines'!$H$53","v":0}]
["Taux d'indemnisation (10% de suppl. risque)",{"$f":"'3. Coûts des machines'!$H$62","v":0}]

{"sheet":"6. Graph. frais fixes et vari.","index":5,"n_rows":9,"n_cols":5,"rows_kept":9,"cut":false,"hidden":false,"merged":[]}
[]
[null,null,"Propriétaire :",{"$f":"'2. Prix actuels'!C1","v":0}]
[]
[null,"Calcul des frais des machines sélectionnées"]
[null,null,null,"Frais fixes","Frais variable"]
[1,{"$f":"INDEX('4. Données de calcul'!$D$4:$D$74,MATCH('3. Coûts des machines'!$D$3,'4. Données de calcul'!$B$4:$B$74))","v":"Sélectionnez un objet"},null,{"$f":"'3. Coûts des machines'!D35","v":0},{"$f":"'3. Coûts des machines'!D46","v":0}]
[2,{"$f":"INDEX('4. Données de calcul'!$D$4:$D$74,MATCH('3. Coûts des machines'!$E$3,'4. Données de calcul'!$B$4:$B$74))","v":"Sélectionnez un objet"},null,{"$f":"'3. Coûts des machines'!E35","v":0},{"$f":"'3. Coûts des machines'!E46","v":0}]
[3,{"$f":"INDEX('4. Données de calcul'!$D$4:$D$74,MATCH('3. Coûts des machines'!$F$3,'4. Données de calcul'!$B$4:$B$74))","v":"Sélectionnez un objet"},null,{"$f":"'3. Coûts des machines'!F35","v":0},{"$f":"'3. Coûts des machines'!F46","v":0}]
[4,{"$f":"INDEX('4. Données de calcul'!$D$4:$D$74,MATCH('3. Coûts des machines'!$G$3,'4. Données de calcul'!$B$4:$B$74))","v":"Sélectionnez un objet"},null,{"$f":"'3. Coûts des machines'!G35","v":0},{"$f":"'3. Coûts des machines'!G46","v":0}]

{"sheet":"7. Graph. coûts horaires","index":6,"n_rows":99,"n_cols":6,"rows_kept":99,"cut":false,"hidden":false,"merged":[]}
[]
[null,"Propriétaire :",{"$f":"'2. Prix actuels'!C1","v":0}]
[]
["Calcul de revient par heure d'utilisation"]
[]
[{"$f":"INDEX('4. Données de calcul'!$D$4:$D$74,MATCH('3. Coûts des machines'!$D$3,'4. Données de calcul'!$B$4:$B$74))","v":"Sélectionnez un objet"}]
[{"$f":"INDEX('4. Données de calcul'!$D$4:$D$74,MATCH('3. Coûts des machines'!$E$3,'4. Données de calcul'!$B$4:$B$74))","v":"Sélectionnez un objet"}]
[{"$f":"INDEX('4. Données de calcul'!$D$4:$D$74,MATCH('3. Coûts des machines'!$F$3,'4. Données de calcul'!$B$4:$B$74))","v":"Sélectionnez un objet"}]
[{"$f":"INDEX('4. Données de calcul'!$D$4:$D$674,MATCH('3. Coûts des machines'!$G$3,'4. Données de calcul'!$B$4:$B$74))","v":"Sélectionnez un objet"}]
[]
[]
[]
[]
[]
[]
[]
[]
[]
[]
[]
[]
[]
[]
[]
[]
[]
[]
[]
[]
[]
[]
[]
[]
[]
[]
[]
[]
[]
[]
[]
[]
[]
[]
[]
[]
[]
[]
[]
[]
[]
[]
[]
[]
[]
[]
[]
[]
[]
[]
[]
[]
[]
[]
[]
[]
[]
[]
[]
[]
[]
[]
["Prix de revient pour chaque machine, en chiffres (de 100 à 2000 h)"]
[]
[null,{"$f":"'3. Coûts des machines'!D81","v":"Sélectionnez un objet"},{"$f":"'3. Coûts des machines'!E81","v":"Sélectionnez un objet"},{"$f":"'3. Coûts des machines'!F81","v":"Sélectionnez un objet"},{"$f":"'3. Coûts des machines'!G81","v":"Sélectionnez un objet"},{"$f":"'3. Coûts des machines'!H81","v":"Total"}]
[100,{"$f":"'3. Coûts des machines'!D97","v":0},{"$f":"'3. Coûts des machines'!E97","v":0},{"$f":"'3. Coûts des machines'!F97","v":0},{"$f":"'3. Coûts des machines'!G97","v":0},{"$f":"'3. Coûts des machines'!H97","v":0}]
[150,{"$f":"'3. Coûts des machines'!D98","v":0},{"$f":"'3. Coûts des machines'!E98","v":0},{"$f":"'3. Coûts des machines'!F98","v":0},{"$f":"'3. Coûts des machines'!G98","v":0},{"$f":"'3. Coûts des machines'!H98","v":0}]
[200,{"$f":"'3. Coûts des machines'!D99","v":0},{"$f":"'3. Coûts des machines'!E99","v":0},{"$f":"'3. Coûts des machines'!F99","v":0},{"$f":"'3. Coûts des machines'!G99","v":0},{"$f":"'3. Coûts des machines'!H99","v":0}]
[250,{"$f":"'3. Coûts des machines'!D100","v":0},{"$f":"'3. Coûts des machines'!E100","v":0},{"$f":"'3. Coûts des machines'!F100","v":0},{"$f":"'3. Coûts des machines'!G100","v":0},{"$f":"'3. Coûts des machines'!H100","v":0}]
[300,{"$f":"'3. Coûts des machines'!D101","v":0},{"$f":"'3. Coûts des machines'!E101","v":0},{"$f":"'3. Coûts des machines'!F101","v":0},{"$f":"'3. Coûts des machines'!G101","v":0},{"$f":"'3. Coûts des machines'!H101","v":0}]
[350,{"$f":"'3. Coûts des machines'!D102","v":0},{"$f":"'3. Coûts des machines'!E102","v":0},{"$f":"'3. Coûts des machines'!F102","v":0},{"$f":"'3. Coûts des machines'!G102","v":0},{"$f":"'3. Coûts des machines'!H102","v":0}]
[400,{"$f":"'3. Coûts des machines'!D103","v":0},{"$f":"'3. Coûts des machines'!E103","v":0},{"$f":"'3. Coûts des machines'!F103","v":0},{"$f":"'3. Coûts des machines'!G103","v":0},{"$f":"'3. Coûts des machines'!H103","v":0}]
[450,{"$f":"'3. Coûts des machines'!D104","v":0},{"$f":"'3. Coûts des machines'!E104","v":0},{"$f":"'3. Coûts des machines'!F104","v":0},{"$f":"'3. Coûts des machines'!G104","v":0},{"$f":"'3. Coûts des machines'!H104","v":0}]
[500,{"$f":"'3. Coûts des machines'!D105","v":0},{"$f":"'3. Coûts des machines'!E105","v":0},{"$f":"'3. Coûts des machines'!F105","v":0},{"$f":"'3. Coûts des machines'!G105","v":0},{"$f":"'3. Coûts des machines'!H105","v":0}]
[550,{"$f":"'3. Coûts des machines'!D106","v":0},{"$f":"'3. Coûts des machines'!E106","v":0},{"$f":"'3. Coûts des machines'!F106","v":0},{"$f":"'3. Coûts des machines'!G106","v":0},{"$f":"'3. Coûts des machines'!H106","v":0}]
[600,{"$f":"'3. Coûts des machines'!D107","v":0},{"$f":"'3. Coûts des machines'!E107","v":0},{"$f":"'3. Coûts des machines'!F107","v":0},{"$f":"'3. Coûts des machines'!G107","v":0},{"$f":"'3. Coûts des machines'!H107","v":0}]
[650,{"$f":"'3. Coûts des machines'!D108","v":0},{"$f":"'3. Coûts des machines'!E108","v":0},{"$f":"'3. Coûts des machines'!F108","v":0},{"$f":"'3. Coûts des machines'!G108","v":0},{"$f":"'3. Coûts des machines'!H108","v":0}]
[700,{"$f":"'3. Coûts des machines'!D109","v":0},{"$f":"'3. Coûts des machines'!E109","v":0},{"$f":"'3. Coûts des machines'!F109","v":0},{"$f":"'3. Coûts des machines'!G109","v":0},{"$f":"'3. Coûts des machines'!H109","v":0}]
[750,{"$f":"'3. Coûts des machines'!D110","v":0},{"$f":"'3. Coûts des machines'!E110","v":0},{"$f":"'3. Coûts des machines'!F110","v":0},{"$f":"'3. Coûts des machines'!G110","v":0},{"$f":"'3. Coûts des machines'!H110","v":0}]
[800,{"$f":"'3. Coûts des machines'!D111","v":0},{"$f":"'3. Coûts des machines'!E111","v":0},{"$f":"'3. Coûts des machines'!F111","v":0},{"$f":"'3. Coûts des machines'!G111","v":0},{"$f":"'3. Coûts des machines'!H111","v":0}]
[850,{"$f":"'3. Coûts des machines'!D112","v":0},{"$f":"'3. Coûts des machines'!E112","v":0},{"$f":"'3. Coûts des machines'!F112","v":0},{"$f":"'3. Coûts des machines'!G112","v":0},{"$f":"'3. Coûts des machines'!H112","v":0}]
[900,{"$f":"'3. Coûts des machines'!D113","v":0},{"$f":"'3. Coûts des machines'!E113","v":0},{"$f":"'3. Coûts des machines'!F113","v":0},{"$f":"'3. Coûts des machines'!G113","v":0},{"$f":"'3. Coûts des machines'!H113","v":0}]
[950,{"$f":"'3. Coûts des machines'!D114","v":0},{"$f":"'3. Coûts des machines'!E114","v":0},{"$f":"'3. Coûts des machines'!F114","v":0},{"$f":"'3. Coûts des machines'!G114","v":0},{"$f":"'3. Coûts des machines'!H114","v":0}]
[1000,{"$f":"'3. Coûts des machines'!D115","v":0},{"$f":"'3. Coûts des machines'!E115","v":0},{"$f":"'3. Coûts des machines'!F115","v":0},{"$f":"'3. Coûts des machines'!G115","v":0},{"$f":"'3. Coûts des machines'!H115","v":0}]
[]
["Plus de 1000 heures d'utilisation"]
[{"$f":"IF(AND('3. Coûts des machines'!D$7>0,'3. Coûts des machines'!D$6>1000),'3. Coûts des machines'!D$6,)","v":0},{"$f":"IF(A96>1000,'3. Coûts des machines'!D$53,)","v":0},null,null,null,{"$f":"SUM(B96:E96)","v":0}]
[{"$f":"IF(AND('3. Coûts des machines'!E$7>0,'3. Coûts des machines'!E$6>1000),'3. Coûts des machines'!E$6,)","v":0},null,{"$f":"IF(A97>1000,'3. Coûts des machines'!E$53,)","v":0},null,null,{"$f":"SUM(B97:E97)","v":0}]
[{"$f":"IF(AND('3. Coûts des machines'!F$7>0,'3. Coûts des machines'!F$6>1000),'3. Coûts des machines'!F$6,)","v":0},null,null,{"$f":"IF(A98>1000,'3. Coûts des machines'!F$53,)","v":0},null,{"$f":"SUM(B98:E98)","v":0}]
[{"$f":"IF(AND('3. Coûts des machines'!G$7>0,'3. Coûts des machines'!G$6>1000),'3. Coûts des machines'!G$6,)","v":0},null,null,null,{"$f":"IF(A96>1000,'3. Coûts des machines'!G$53,)","v":0},{"$f":"SUM(B99:E99)","v":0}]